ExportXMLWordPrintableJSON

    • None
    • None
    • Compass

      task test-connectivity from variant connectivity-tests of version 10gen_compass_main_f2b69ca8578fd97facdd758bee8b8fdf31375e4b with status failed

      View Current Status

      Team assignment of this issue was determined by:
      No assigned team found in offending version or version was one of the first on the branch
      No valid failure metadata tags found.
      No test file name found.
      No task tags found.
      No assigned team found by build variant tags.
      This task is not a dynamic task.
      Found assignment by default team: Compass

      Not caused by you? Learn who to reassign it to in the wiki FAQ section 'Foliage has assigned a ticket to the wrong team, what do I do?'

      Logs: all_log task_log agent_log system_log

      Foliage thinks that this is the breaking commit version in this task

      *In this github commit Recent runs (including this commit) had the following results:

      version task status status type finish time
      10gen_compass_main_f2b69ca8578fd97facdd758bee8b8fdf31375e4b task FAILED test 2026-08-18 17:59:29.141000+00:00
      10gen_compass_main_f2b69ca8578fd97facdd758bee8b8fdf31375e4b task FAILED test 2026-08-18 17:59:29.141000+00:00
      skipped 10gen_compass_main_74072c5a8bc1ad7fa23ff82fa4b8639212c6ba8f
      UNDISPATCHED
      10gen_compass_main_77aa77f4686562ced2c84f50d30453752b805d87 task FAILED test 2026-08-18 14:10:20.146000+00:00

      Reported by cron job with id 1c8f6c0a-984f-49c6-8550-ba85afa32590

            Assignee:
            Unassigned
            Reporter:
            Cloud GitHub Webhooks
            Votes:
            0 Vote for this issue
            Watchers:
            1 Start watching this issue

              Created:
              Updated:
              Resolved: