ExportXMLWordPrintableJSON

    • None
    • None
    • Compass

      task smoketest-packaged-app from variant smoketest-packaged-app of version 10gen_compass_main_61f45b3d82e35767429624663e0e2972f629c4f9 with status failed

      View Current Status

      Team assignment of this issue was determined by:
      No assigned team found in offending version or version was one of the first on the branch
      No valid failure metadata tags found.
      No test file name found.
      No task tags found.
      No assigned team found by build variant tags.
      This task is not a dynamic task.
      Found assignment by default team: Compass

      Not caused by you? Learn who to reassign it to in the wiki FAQ section 'Foliage has assigned a ticket to the wrong team, what do I do?'

      Logs: all_log task_log agent_log system_log

      Foliage thinks that this is the breaking commit version in this task

      *In this github commit Recent runs (including this commit) had the following results:

      version task status status type finish time
      10gen_compass_main_61f45b3d82e35767429624663e0e2972f629c4f9 task FAILED test 2026-08-21 11:44:31.973000+00:00
      10gen_compass_main_61f45b3d82e35767429624663e0e2972f629c4f9 task FAILED test 2026-08-21 11:44:31.973000+00:00
      10gen_compass_main_04b1c50a3223b5e3f248d44d0db5e030bdbb6c0f task FAILED test 2026-08-21 10:10:37.525000+00:00

      Reported by cron job with id a60b927b-3eb0-44c0-b1d2-7e47e69aa72f

            Assignee:
            Unassigned
            Reporter:
            Cloud GitHub Webhooks
            Votes:
            0 Vote for this issue
            Watchers:
            1 Start watching this issue

              Created:
              Updated:
              Resolved: