ExportXMLWordPrintableJSON

    • Not Needed
    • None
    • Compass

      Due to recurring issues, this issue is considered Flaky

      task smoketest-packaged-app from variant smoketest-packaged-app of version 10gen_compass_main_67f58afc8b253b3d8cfc810f23f408f83f5dec45 with status failed

      View Current Status

      Team assignment of this issue was determined by:
      No offending version found.
      No valid failure metadata tags found.
      No test file name found.
      No assigned team found for test file path.
      No task tags found.
      No assigned team found by build variant tags.
      This task is not a dynamic task.
      Found assignment by default team: Compass

      Not caused by you? Learn who to reassign it to in the wiki FAQ section 'Foliage has assigned a ticket to the wrong team, what do I do?'

      Logs: all_log task_log agent_log system_log

      Recent runs (including this commit) had the following results:

      version task status status type finish time
      10gen_compass_main_67f58afc8b253b3d8cfc810f23f408f83f5dec45 task FAILED test 2026-08-26 16:18:54.659000+00:00
      10gen_compass_main_67f58afc8b253b3d8cfc810f23f408f83f5dec45 task FAILED test 2026-08-26 16:18:54.659000+00:00
      10gen_compass_main_f0436fdd45b00487a23fb295759c2026fa56a67a task FAILED test 2026-08-26 15:07:03.291000+00:00
      skipped from 10gen_compass_main_124d4a6dc5cb2d41f5e104d514278f58b084efdf to 10gen_compass_main_18488ba0301e881c2f3d3e738187a2cd44bc1924
      10gen_compass_main_7b6d77fb11e5cd6fe885bf73e928469ec35ad621 task FAILED test 2026-08-26 16:15:32.406000+00:00
      10gen_compass_main_22c7495be757e2db5d10dffd4ec1cb1f5c06dfa1 task FAILED test 2026-08-26 13:27:48.178000+00:00
      10gen_compass_main_08dd031a6c6b996ca9a57fd2b8ba7f6b728d0d84 task FAILED test 2026-08-26 10:16:10.809000+00:00
      10gen_compass_main_698b8231a5937281c42fda938d13bddd5b36857e task SUCCESS Default 2026-08-26 08:41:54.045000+00:00
      skipped 10gen_compass_main_8ac78a7f3a754c0faefc685d508aa7e3ab8e847c
      UNDISPATCHED
      10gen_compass_main_abecd6b46cadc70d9174887657419b4494ca5421 task SUCCESS Default 2026-08-26 05:58:11.178000+00:00
      10gen_compass_main_e2bce3b78ae2bff3ba8bee563a58235ad87a94dc task SUCCESS Default 2026-08-25 16:05:57.290000+00:00
      10gen_compass_main_7541cac948d92a0ddf9dc67495d9aa670064e31f task SUCCESS Default 2026-08-25 15:36:00.887000+00:00
      10gen_compass_main_003905098026f2b9a14a4f5b06ec4b3b3b574f15 task SUCCESS Default 2026-08-25 15:43:34.457000+00:00
      skipped 10gen_compass_main_ced49c4243dace69acaa76f0ad8fb2bc41d77e57
      UNDISPATCHED
      10gen_compass_main_4b98fd81540881cb8b21d3bf36b75a42912b88e7 task SUCCESS Default 2026-08-25 07:04:12.408000+00:00
      10gen_compass_main_0fb0816937c71d0e2f0987c5563c0f7a6284cba7 task SUCCESS Default 2026-08-25 07:08:33.588000+00:00
      10gen_compass_main_0d4aaaf2cceff697da4c54ea26b0394ad001b43a task SUCCESS Default 2026-08-25 00:41:08.604000+00:00
      10gen_compass_main_37531a194db053b7c8e4a0601604183a7c7a56c9 task SUCCESS Default 2026-08-24 14:27:47.784000+00:00
      skipped 10gen_compass_main_b84094109a4e70fad24ffd00154c905671b33798
      UNDISPATCHED
      10gen_compass_main_0447049c2c8f104cafd7ef51b399b5e67242cebc task SUCCESS Default 2026-08-24 10:46:14.874000+00:00
      10gen_compass_main_712ab0e22ec658585af1f45faa1dd77529c3b362 task SUCCESS Default 2026-08-24 10:46:59.468000+00:00
      10gen_compass_main_8eb53182b4b7b1c53a9d23cf2450a272a9f7583a task SUCCESS Default 2026-08-24 10:55:26.064000+00:00
      skipped 10gen_compass_main_dca4041d59784d6b664c954b21c3b1052857c89a
      UNDISPATCHED
      10gen_compass_main_227b121caa7dbb8b16eb9cca34d272d79ef1c3a5 task SUCCESS Default 2026-08-24 07:13:37.550000+00:00
      skipped from 10gen_compass_main_0a3e4b790c111220f51016ff853c9e4ca331dfa5 to 10gen_compass_main_9bb94bcfa21f0df6ec99f24cf9a74f337163be1b
      10gen_compass_main_63e30b4d819b1b03caeb5e049c6a62ce05b82420 task SUCCESS Default 2026-08-22 07:28:32.841000+00:00
      10gen_compass_main_e0bc6b3ecf20689fa5e05776c9b7eeb0a19a032a task FAILED test 2026-08-21 18:57:21.739000+00:00

      Reported by cron job with id 091eeed1-0182-4cbf-9c04-8b418ad32645

            Assignee:
            Unassigned
            Reporter:
            Cloud GitHub Webhooks
            Votes:
            0 Vote for this issue
            Watchers:
            2 Start watching this issue

              Created:
              Updated:
              Resolved: