ExportXMLWordPrintableJSON

    • Not Needed
    • None
    • Compass

      task test-web-sandbox-atlas-cloud-3 from variant test-web-sandbox-atlas-cloud of version 10gen_compass_main_f49a5d4006cd772aef397ba391d52719fd3cc5de with status failed

      View Current Status

      Team assignment of this issue was determined by:
      No assigned team found in offending version or version was one of the first on the branch
      No valid failure metadata tags found.
      No test file name found.
      No test file path found.
      No assigned team found by task tags.
      No assigned team found by build variant tags.
      This task is not a dynamic task.
      Found assignment by default team: Compass

      Not caused by you? Learn who to reassign it to in the wiki FAQ section 'Foliage has assigned a ticket to the wrong team, what do I do?'

      Logs: all_log task_log agent_log system_log

      Foliage thinks that this is the breaking commit version in this task

      *In this github commit Recent runs (including this commit) had the following results:

      version task status status type finish time
      10gen_compass_main_f49a5d4006cd772aef397ba391d52719fd3cc5de task FAILED test 2026-09-14 16:27:57.942000+00:00
      10gen_compass_main_f49a5d4006cd772aef397ba391d52719fd3cc5de task FAILED test 2026-09-14 16:27:57.942000+00:00
      10gen_compass_main_eedd14128e9ad21e90926a98b8545dc317a5c340 task FAILED test 2026-09-14 14:30:43.464000+00:00

      Reported by cron job with id ee6f5d01-98a1-4859-8470-43a0956b5241

            Assignee:
            Unassigned
            Reporter:
            Cloud GitHub Webhooks
            Votes:
            0 Vote for this issue
            Watchers:
            1 Start watching this issue

              Created:
              Updated:
              Resolved: