-
Type:
Bug
-
Resolution: Gone away
-
Priority:
Critical - P2
-
None
-
Affects Version/s: None
-
Component/s: Test Failures
-
None
-
None
-
Compass
task smoketest-packaged-app from variant smoketest-packaged-app of version 10gen_compass_main_eedd14128e9ad21e90926a98b8545dc317a5c340 with status failed
Team assignment of this issue was determined by:
No assigned team found in offending version or version was one of the first on the branch
No valid failure metadata tags found.
No test file name found.
No assigned team found for test file path.
No task tags found.
No assigned team found by build variant tags.
This task is not a dynamic task.
Found assignment by default team: Compass
Not caused by you? Learn who to reassign it to in the wiki FAQ section 'Foliage has assigned a ticket to the wrong team, what do I do?'
Logs: all_log task_log agent_log system_log
Foliage thinks that this is the breaking commit version in this task
*In this github commit Recent runs (including this commit) had the following results:
| version | task | status | status type | finish time |
|---|---|---|---|---|
| 10gen_compass_main_eedd14128e9ad21e90926a98b8545dc317a5c340 | task | FAILED | test | 2026-09-14 15:25:40.635000+00:00 |
| 10gen_compass_main_eedd14128e9ad21e90926a98b8545dc317a5c340 | task | FAILED | test | 2026-09-14 15:25:40.635000+00:00 |
| 10gen_compass_main_96fc99f752d0d47a2db77b3c6e777471c72abf93 | task | FAILED | test | 2026-09-14 12:45:13.379000+00:00 |
Reported by cron job with id ee6f5d01-98a1-4859-8470-43a0956b5241