ExportXMLWordPrintableJSON

    • None
    • None
    • Compass

      task test-web-sandbox-atlas-cloud-2 from variant test-web-sandbox-atlas-cloud of version 10gen_compass_main_07bf7c52dfc70637e2ba71a543add72e514605b7 with status failed

      View Current Status

      Team assignment of this issue was determined by:
      No assigned team found in offending version or version was one of the first on the branch
      No valid failure metadata tags found.
      No test file name found.
      No test file path found.
      No assigned team found by task tags.
      No assigned team found by build variant tags.
      This task is not a dynamic task.
      Found assignment by default team: Compass

      Not caused by you? Learn who to reassign it to in the wiki FAQ section 'Foliage has assigned a ticket to the wrong team, what do I do?'

      Logs: all_log task_log agent_log system_log

      Foliage thinks that this is the breaking commit version in this task

      *In this github commit Recent runs (including this commit) had the following results:

      version task status status type finish time
      10gen_compass_main_07bf7c52dfc70637e2ba71a543add72e514605b7 task FAILED test 2026-09-22 15:48:37.431000+00:00
      10gen_compass_main_07bf7c52dfc70637e2ba71a543add72e514605b7 task FAILED test 2026-09-22 15:48:37.431000+00:00
      10gen_compass_main_aef1e1ab821bab8bee7adba6adaba798fa0e8b44 task FAILED test 2026-09-22 15:28:43.590000+00:00
      10gen_compass_main_9d8a8f03a4ef99dce27a9bcd49471325d954f28b task FAILED test 2026-09-22 11:06:53.124000+00:00
      10gen_compass_main_06487d61191c8a193910e97460bddd610d15817d task SUCCESS Default 2026-09-22 06:47:45.075000+00:00
      skipped 10gen_compass_main_ace812a27c36aefe81ce1483e5eace427a2627b1
      UNDISPATCHED
      10gen_compass_main_fa79e9cdbeb519e6ba1e469b44e4bc88cf511cf9 task FAILED test 2026-09-22 06:00:18.116000+00:00
      10gen_compass_main_af8518cd0c787665f4add6e5b8333156c796fa24 task SUCCESS Default 2026-09-21 20:51:14.014000+00:00
      10gen_compass_main_965934c9f2186bc73befd96fa5f4318bf6961e43 task SUCCESS Default 2026-09-21 14:40:22.701000+00:00
      skipped 10gen_compass_main_35234db832a1fbda862a98a906893131fd6b28fa
      UNDISPATCHED
      10gen_compass_main_3053800bccc83c0bff9578fb6a2df246f5612742 task SUCCESS Default 2026-09-21 10:03:49.379000+00:00
      skipped 10gen_compass_main_5430ba4468df78adfc3f2a1fb6094cacddc5b88e
      UNDISPATCHED
      10gen_compass_main_b61ccd6a9cbffb96a15b84f03edcd2b87878927d task SUCCESS Default 2026-09-20 06:43:56.345000+00:00
      skipped 10gen_compass_main_c38b67ccea451a20fd64cb79bfe40a6298a28ef8
      UNDISPATCHED
      10gen_compass_main_3f00989d278e61b767263bbe7f67895809811a50 task SUCCESS Default 2026-09-18 19:48:36.882000+00:00
      10gen_compass_main_7a2051e975db163988a659ac8b2cc3f9b8847a3e task FAILED test 2026-09-18 14:02:29.016000+00:00
      skipped 10gen_compass_main_a50c2817983c06e2bdc9ae32861098664c0c7e88
      UNDISPATCHED
      10gen_compass_main_7a1770b8f424bcd3d102a3a741c87ca373950cff task SUCCESS Default 2026-09-18 10:22:04.615000+00:00
      skipped 10gen_compass_main_715d21dedc8dbf9fba7cf186307f1d479c6b4899
      UNDISPATCHED
      10gen_compass_main_8036f24c80dfaaba852f5fcb314667ad9d19c4a6 task SUCCESS Default 2026-09-17 19:34:18.506000+00:00
      10gen_compass_main_18b9284c2de5c1daef72e6fa187efb016f597539 task SUCCESS Default 2026-09-16 17:03:27.394000+00:00
      skipped 10gen_compass_main_0e5179b637fd315b7836bd7bfd8595756b47c17d
      UNDISPATCHED
      10gen_compass_main_df709261ffdbed0d1f0d6d828fd1383e99be57fe task SUCCESS Default 2026-09-16 16:22:26.017000+00:00
      10gen_compass_main_d21fb4a3e850c0b0b852e1ee9f3a8cc00e884212 task FAILED test 2026-09-16 15:54:03.552000+00:00
      skipped 10gen_compass_main_460e290fde31341de30794ee773cb10a4a9982f6
      UNDISPATCHED
      10gen_compass_main_a5e50e7638e0dd49734157d98446c54a46d6751c task SUCCESS Default 2026-09-16 16:20:08.987000+00:00
      10gen_compass_main_6fb90274fa287c35a45fa4bf7521ce2862d0e401 task FAILED test 2026-09-16 12:46:56.875000+00:00
      skipped 10gen_compass_main_9279a49d4cafef9863e33269d500ed1ab6ce51d5
      UNDISPATCHED
      10gen_compass_main_78688c4a6536840885179ac02ca483f6668f8810 task FAILED test 2026-09-16 12:09:52.466000+00:00
      10gen_compass_main_02f6e37f46d47413b9ace7f532d6830de98bf91f task FAILED test 2026-09-15 17:09:03.382000+00:00

      Reported by cron job with id f07d1774-4d54-4aa7-a892-8af7153b3a3d

            Assignee:
            Unassigned
            Reporter:
            Cloud GitHub Webhooks
            Votes:
            0 Vote for this issue
            Watchers:
            1 Start watching this issue

              Created:
              Updated:
              Resolved: