ExportXMLWordPrintableJSON

    • Not Needed
    • None
    • Compass

      task test-web-sandbox-atlas-cloud-3 from variant test-web-sandbox-atlas-cloud of version 10gen_compass_main_04bf4c9edf8e22f828cde0710feda3f273dd3310 with status failed

      View Current Status

      Team assignment of this issue was determined by:
      No assigned team found in offending version or version was one of the first on the branch
      No valid failure metadata tags found.
      No test file name found.
      No test file path found.
      No assigned team found by task tags.
      No assigned team found by build variant tags.
      This task is not a dynamic task.
      Found assignment by default team: Compass

      Not caused by you? Learn who to reassign it to in the wiki FAQ section 'Foliage has assigned a ticket to the wrong team, what do I do?'

      Logs: all_log task_log agent_log system_log

      Foliage thinks that this is the breaking commit version in this task

      *In this github commit Recent runs (including this commit) had the following results:

      version task status status type finish time
      10gen_compass_main_04bf4c9edf8e22f828cde0710feda3f273dd3310 task FAILED test 2026-09-24 15:56:24.781000+00:00
      10gen_compass_main_04bf4c9edf8e22f828cde0710feda3f273dd3310 task FAILED test 2026-09-24 15:56:24.781000+00:00
      10gen_compass_main_1575ce6c23ef60d971baef93548fca99a384b29a task FAILED test 2026-09-24 15:11:11.836000+00:00

      Reported by cron job with id 6a49cabe-581e-4326-8acd-4c15ebacd71b

            Assignee:
            Unassigned
            Reporter:
            Cloud GitHub Webhooks
            Votes:
            0 Vote for this issue
            Watchers:
            1 Start watching this issue

              Created:
              Updated:
              Resolved: