ExportXMLWordPrintableJSON

    • Not Needed
    • None
    • Compass

      task test-web-sandbox-atlas-cloud-2 from variant test-web-sandbox-atlas-cloud of version 10gen_compass_main_35d20772c43592e1da5b0d298ca549965adba291 with status failed

      View Current Status

      Team assignment of this issue was determined by:
      No assigned team found in offending version or version was one of the first on the branch
      No valid failure metadata tags found.
      No test file name found.
      No test file path found.
      No assigned team found by task tags.
      No assigned team found by build variant tags.
      This task is not a dynamic task.
      Found assignment by default team: Compass

      Not caused by you? Learn who to reassign it to in the wiki FAQ section 'Foliage has assigned a ticket to the wrong team, what do I do?'

      Logs: all_log task_log agent_log system_log

      Foliage thinks that this is the breaking commit version in this task

      *In this github commit Recent runs (including this commit) had the following results:

      version task status status type finish time
      10gen_compass_main_35d20772c43592e1da5b0d298ca549965adba291 task FAILED test 2026-09-25 08:59:30.497000+00:00
      10gen_compass_main_35d20772c43592e1da5b0d298ca549965adba291 task FAILED test 2026-09-25 08:59:30.497000+00:00
      skipped 10gen_compass_main_6d718f52b1be4164655019e9f130f31af67a1ad3
      UNDISPATCHED
      10gen_compass_main_02f0a77262f12480bb0f1688b640dcdc119352ca task FAILED test 2026-09-25 07:57:45.599000+00:00

      Reported by cron job with id 4e8879b4-1e68-4cc5-a218-3fad02e4c9dd

            Assignee:
            Unassigned
            Reporter:
            Cloud GitHub Webhooks
            Votes:
            0 Vote for this issue
            Watchers:
            1 Start watching this issue

              Created:
              Updated:
              Resolved: