ExportXMLWordPrintableJSON

    • Not Needed
    • None
    • Compass

      task test-web-sandbox-atlas-cloud-2 from variant test-web-sandbox-atlas-cloud of version 10gen_compass_main_284cd680600adc27b524a3b9443ad78c5c503916 with status failed

      View Current Status

      Team assignment of this issue was determined by:
      No assigned team found in offending version or version was one of the first on the branch
      No valid failure metadata tags found.
      No test file name found.
      No test file path found.
      No assigned team found by task tags.
      No assigned team found by build variant tags.
      This task is not a dynamic task.
      Found assignment by default team: Compass

      Not caused by you? Learn who to reassign it to in the wiki FAQ section 'Foliage has assigned a ticket to the wrong team, what do I do?'

      Logs: all_log task_log agent_log system_log

      Foliage thinks that this is the breaking commit version in this task

      *In this github commit Recent runs (including this commit) had the following results:

      version task status status type finish time
      10gen_compass_main_284cd680600adc27b524a3b9443ad78c5c503916 task FAILED test 2026-09-30 22:01:12.525000+00:00
      10gen_compass_main_284cd680600adc27b524a3b9443ad78c5c503916 task FAILED test 2026-09-30 22:01:12.525000+00:00
      skipped 10gen_compass_main_2933e5540ce944c8521816cf1459b7d0f426c529
      UNDISPATCHED
      10gen_compass_main_9c22e6a6c523e0a64654f721a14e8bb95196784f task FAILED test 2026-09-30 21:11:21.104000+00:00
      skipped 10gen_compass_main_371b21fd0e69966c7414ffe18e127bbe4eb0c693
      UNDISPATCHED
      10gen_compass_main_e56ea08743aaf9922789195b216c6fd639e7ead8 task FAILED test 2026-09-30 13:31:07.695000+00:00
      skipped 10gen_compass_main_7c508e08fd6933916fa9ccfc62e3ebc526143d34
      UNDISPATCHED
      10gen_compass_main_9c82f907f4caa058277661e0ae0abf8d7e0f3aa5 task SUCCESS Default 2026-09-30 07:53:49.709000+00:00
      10gen_compass_main_c0bbaf59f019e3d7ce1f88beae80b5b823fe4dfc task SUCCESS Default 2026-09-30 07:43:55+00:00
      10gen_compass_main_5c49c9337c6ccc2fd4c2f5e98c8a5bd664cdabd3 task SUCCESS Default 2026-09-29 19:38:57.382000+00:00
      10gen_compass_main_eabae0b58956d634f6f7fc29cdadf99fa42157a5 task SUCCESS Default 2026-09-29 16:17:09.597000+00:00
      skipped 10gen_compass_main_a8ac0761ae1af54be1187ec0ca51feb65b6f647e
      UNDISPATCHED
      10gen_compass_main_d618aaf2f9c4d46fddf55908b73a6fe83a130d17 task FAILED test 2026-09-29 10:29:16.123000+00:00
      skipped 10gen_compass_main_b03fa861e53034981ece62ab9a0a9e9015a5d378
      UNDISPATCHED
      10gen_compass_main_23c9cad9cb0dfa34f5f938e3d68225ca7501ffa0 task SUCCESS Default 2026-09-28 21:05:33.547000+00:00
      10gen_compass_main_d41c58e3481669337c47b2d2f8aad723ba2deeb7 task SUCCESS Default 2026-09-28 21:05:43.057000+00:00
      skipped from 10gen_compass_main_60bff60eeea410722866c436af8dc1df3da20fed to 10gen_compass_main_87ce378d262a7c46c23a88724c9de3ac898dce33
      10gen_compass_main_13069dd486790839d988fbef8ff12c1056fa86c8 task FAILED test 2026-09-25 16:39:44.874000+00:00
      skipped 10gen_compass_main_b3bac1daebaee104b6dfa1c8b6c0cf726a60c24f
      UNDISPATCHED
      10gen_compass_main_b2f75af5cbbb5d347dbf57474948ba41217f5e7f task SUCCESS Default 2026-09-25 14:13:25.936000+00:00
      10gen_compass_main_35d20772c43592e1da5b0d298ca549965adba291 task FAILED test 2026-09-25 08:59:30.497000+00:00
      skipped 10gen_compass_main_6d718f52b1be4164655019e9f130f31af67a1ad3
      UNDISPATCHED
      10gen_compass_main_02f0a77262f12480bb0f1688b640dcdc119352ca task FAILED test 2026-09-25 07:57:45.599000+00:00
      10gen_compass_main_04bf4c9edf8e22f828cde0710feda3f273dd3310 task SUCCESS Default 2026-09-24 15:06:00.886000+00:00
      10gen_compass_main_1575ce6c23ef60d971baef93548fca99a384b29a task SUCCESS Default 2026-09-24 14:34:41.343000+00:00
      skipped 10gen_compass_main_271867dec031a128f700cea141d7d441ec3e3d7b
      UNDISPATCHED
      10gen_compass_main_a940c09b66f2ae0fcdbaa1eb8960580468e15746 task FAILED test 2026-09-24 14:23:53.246000+00:00
      skipped 10gen_compass_main_daa6914facbaf4df364727d1900afc475b0c1846
      UNDISPATCHED
      10gen_compass_main_3a5ea6c620df58199f97d056adca018c77605b98 task SUCCESS Default 2026-09-24 10:29:15.361000+00:00
      10gen_compass_main_9ce7d774a6cd3f8b0ba033948dd3c474c50d067a task FAILED test 2026-09-24 11:16:56.480000+00:00
      10gen_compass_main_ad926b4e0dba65383d80450a6afcf76c5558da43 task SUCCESS Default 2026-09-23 18:31:30.626000+00:00

      Reported by cron job with id 4904b797-af76-4734-bf2e-fa232d44f326

            Assignee:
            Unassigned
            Reporter:
            Cloud GitHub Webhooks
            Votes:
            0 Vote for this issue
            Watchers:
            1 Start watching this issue

              Created:
              Updated:
              Resolved: