ExportXMLWordPrintableJSON

    • None
    • None
    • Compass

      task test-web-sandbox-atlas-cloud-1 from variant test-web-sandbox-atlas-cloud of version 10gen_compass_main_f7840f3172d2bab6388d786925c9df717b7f0ec5 with status failed

      View Current Status

      Team assignment of this issue was determined by:
      No assigned team found in offending version or version was one of the first on the branch
      No valid failure metadata tags found.
      No test file name found.
      No test file path found.
      No assigned team found by task tags.
      No assigned team found by build variant tags.
      This task is not a dynamic task.
      Found assignment by default team: Compass

      Not caused by you? Learn who to reassign it to in the wiki FAQ section 'Foliage has assigned a ticket to the wrong team, what do I do?'

      Logs: all_log task_log agent_log system_log

      Foliage thinks that this is the breaking commit version in this task

      *In this github commit Recent runs (including this commit) had the following results:

      version task status status type finish time
      10gen_compass_main_f7840f3172d2bab6388d786925c9df717b7f0ec5 task FAILED test 2026-10-02 14:09:58.650000+00:00
      10gen_compass_main_f7840f3172d2bab6388d786925c9df717b7f0ec5 task FAILED test 2026-10-02 14:09:58.650000+00:00
      10gen_compass_main_2145ee50ad1484ec3e83d7e50da1141daf619c33 task FAILED test 2026-10-02 13:43:52.590000+00:00

      Reported by cron job with id 1d46a295-ec7d-4ce6-a85c-df025c68ecb1

            Assignee:
            Unassigned
            Reporter:
            Cloud GitHub Webhooks
            Votes:
            0 Vote for this issue
            Watchers:
            1 Start watching this issue

              Created:
              Updated: