Intermittent failure: ccache: error: /home/ubuntu/.ccache/ccache.conf: No such file or directory

XMLWordPrintableJSON

    • Type: Task
    • Resolution: Gone away
    • Priority: Major - P3
    • None
    • Affects Version/s: None
    • Component/s: None
    • 🔵 Done
    • Hide

      1. What would you like to communicate to the user about this feature?
      2. Would you like the user to see examples of the syntax and/or executable code and its output?
      3. Which versions of the driver/connector does this apply to?

      Show
      1. What would you like to communicate to the user about this feature? 2. Would you like the user to see examples of the syntax and/or executable code and its output? 3. Which versions of the driver/connector does this apply to?
    • None
    • None
    • None
    • None
    • None
    • None

      Some compile tasks fail with the following error:

      [2022/02/28 18:15:29.829] ccache: error: /home/ubuntu/.ccache/ccache.conf: No such file or directory[2022/02/28 18:15:29.829] make[2]: *** [src/libbson/CMakeFiles/bson_static.dir/src/bson/bson-error.c.o] Error 1[2022/02/28 18:15:29.829] make[2]: *** Waiting for unfinished jobs.... 

       

      Example

            Assignee:
            Ezra Chung
            Reporter:
            Kevin Albertson
            Votes:
            0 Vote for this issue
            Watchers:
            3 Start watching this issue

              Created:
              Updated:
              Resolved: