-
Type:
Bug
-
Resolution: Gone away
-
Priority:
Critical - P2
-
None
-
Affects Version/s: None
-
Component/s: Test Failures
-
None
-
Mongosh
task sign_artifact_darwin_x64 from variant e2e_tests_darwin_arm64_m805 of version mongosh_0bd2d27de079a6a43a43d0082a607156b069e806 with status failed
Team assignment of this issue was determined by:
No assigned team found in offending version or version was one of the first on the branch
No valid failure metadata tags found.
No test file name found.
No assigned team found for test file path.
No task tags found.
No assigned team found by build variant tags.
This task is not a dynamic task.
Found assignment by default team: Mongosh
Not caused by you? Learn who to reassign it to in the wiki FAQ section 'Foliage has assigned a ticket to the wrong team, what do I do?'
Logs: all_log task_log agent_log system_log
Foliage thinks that this is the breaking commit version in this task
*In this github commit Recent runs (including this commit) had the following results:
| version | task | status | status type | finish time |
|---|---|---|---|---|
| mongosh_0bd2d27de079a6a43a43d0082a607156b069e806 | task | FAILED | test | 2026-09-10 09:16:24.329000+00:00 |
| mongosh_0bd2d27de079a6a43a43d0082a607156b069e806 | task | FAILED | test | 2026-09-10 09:16:24.329000+00:00 |
| mongosh_f8f6420cdf2f48512121cf30dc35266fc5d180a4 | task | FAILED | test | 2026-09-10 09:13:27.187000+00:00 |
Reported by cron job with id b4d6de36-7918-4a3b-88f2-10d7b7ba1720