Uploaded image for project: 'Python Driver'
  1. Python Driver
  2. PYTHON-3725

Test Failure - MockupDB test_network_disconnect_primary

    • Type: Icon: Build Failure Build Failure
    • Resolution: Fixed
    • Priority: Icon: Major - P3 Major - P3
    • 4.4
    • Affects Version/s: None
    • Component/s: None
    • Labels:
      None

      MockupDB test_network_disconnect_primary has been failing since PYTHON-2504:

        [2023/05/16 20:09:38.223] FAIL: test_network_disconnect_primary (test_network_disconnect_primary.TestNetworkDisconnectPrimary)
       [2023/05/16 20:09:38.223] ----------------------------------------------------------------------
       [2023/05/16 20:09:38.223] Traceback (most recent call last):
       [2023/05/16 20:09:38.223]   File "/data/mci/1e6b537a2e91ca0aade11b1d506eb4f9/src/test/mockupdb/test_network_disconnect_primary.py", line 51, in test_network_disconnect_primary
       [2023/05/16 20:09:38.223]     wait_until(lambda: client.primary == primary.address, "discover primary")
       [2023/05/16 20:09:38.223]   File "/data/mci/1e6b537a2e91ca0aade11b1d506eb4f9/src/mockuptests/lib/python3.7/site-packages/mockupdb/__init__.py", line 234, in wait_until
       [2023/05/16 20:09:38.223]     raise AssertionError("Didn't ever %s" % success_description)
       [2023/05/16 20:09:38.223] AssertionError: Didn't ever discover primary
      

      https://evergreen.mongodb.com/task/mongo_python_driver_mockupdb_tests__platform~rhel84_python_version~3.7_mockupdb_0092b0af79378abf35b6db73a082ecb91af1d973_23_05_11_22_27_17

            Assignee:
            shane.harvey@mongodb.com Shane Harvey
            Reporter:
            shane.harvey@mongodb.com Shane Harvey
            Votes:
            0 Vote for this issue
            Watchers:
            1 Start watching this issue

              Created:
              Updated:
              Resolved: