Uploaded image for project: 'Core Server'
  1. Core Server
  2. SERVER-10181

fassert during parallel/basicPlus.js on Linux 64-bit DEBUG

    XMLWordPrintable

    Details

    • Type: Bug
    • Status: Closed
    • Priority: Major - P3
    • Resolution: Fixed
    • Affects Version/s: None
    • Fix Version/s: 2.5.2
    • Component/s: Testing Infrastructure
    • Labels:
    • Environment:
      Linux 64-bit DEBUG Build #2320
    • Operating System:
      ALL

      Description

      Linux 64-bit DEBUG Build #2320

      Given that this is a parallel test, I don't know which test actually triggered this failure.

      http://buildbot.mongodb.org/builders/Linux%2064-bit%20DEBUG/builds/2320/steps/test_14/logs/stdio
      http://buildlogs.mongodb.org/Linux%2064-bit%20DEBUG/builds/2320/test/parallel/basicPlus.js

      Wed Jul 10 17:32:07.615 [conn81] test.system.js Fatal Assertion 16236
      Wed Jul 10 17:32:07.637 [conn81] test.system.js 0x11d8441 0x11b6c25 0x11a27e6 0xbe8d74 0x1009bb0 0xd99cee 0xd99f08 0xd98562 0xf30dfc 0xf33397 0xeb6209 0xeb721c 0xebabe3 0xc70905 0xc467c1 0xebadce 0x116b3d3 0x116d5e4 0x116c260 0xef9596 
       /data/buildslaves/Linux_64bit_DEBUG/mongo/mongod(_ZN5mongo15printStackTraceERSo+0x29) [0x11d8441]
       /data/buildslaves/Linux_64bit_DEBUG/mongo/mongod(_ZN5mongo10logContextEPKc+0x94) [0x11b6c25]
       /data/buildslaves/Linux_64bit_DEBUG/mongo/mongod(_ZN5mongo13fassertFailedEi+0x62) [0x11a27e6]
       /data/buildslaves/Linux_64bit_DEBUG/mongo/mongod(_ZN5mongo7fassertEib+0x29) [0xbe8d74]
       /data/buildslaves/Linux_64bit_DEBUG/mongo/mongod(_ZNK5mongo6Record10_accessingEv+0x11c) [0x1009bb0]
       /data/buildslaves/Linux_64bit_DEBUG/mongo/mongod(_ZN5mongo6Record7getNextERKNS_7DiskLocE+0x24) [0xd99cee]
       /data/buildslaves/Linux_64bit_DEBUG/mongo/mongod(_ZNK5mongo7Forward4nextERKNS_7DiskLocE+0x34) [0xd99f08]
       /data/buildslaves/Linux_64bit_DEBUG/mongo/mongod(_ZN5mongo11BasicCursor7advanceEv+0x102) [0xd98562]
       /data/buildslaves/Linux_64bit_DEBUG/mongo/mongod(_ZN5mongo23queryWithQueryOptimizerEiRKSsRKNS_7BSONObjERNS_5CurOpES4_S4_RKN5boost10shared_ptrINS_11ParsedQueryEEES4_RKNS_12ChunkVersionERNS7_10scoped_ptrINS_25PageFaultRetryableSectionEEERNSG_INS_19NoPageFaultsAllowedEEERNS_7MessageE+0x701) [0xf30dfc]
       /data/buildslaves/Linux_64bit_DEBUG/mongo/mongod(_ZN5mongo8runQueryERNS_7MessageERNS_12QueryMessageERNS_5CurOpES1_+0x129b) [0xf33397]
       /data/buildslaves/Linux_64bit_DEBUG/mongo/mongod() [0xeb6209]
       /data/buildslaves/Linux_64bit_DEBUG/mongo/mongod(_ZN5mongo16assembleResponseERNS_7MessageERNS_10DbResponseERKNS_11HostAndPortE+0x385) [0xeb721c]
       /data/buildslaves/Linux_64bit_DEBUG/mongo/mongod(_ZN5mongo14DBDirectClient4callERNS_7MessageES2_bPSs+0x91) [0xebabe3]
       /data/buildslaves/Linux_64bit_DEBUG/mongo/mongod(_ZN5mongo14DBClientCursor4initEv+0xd7) [0xc70905]
       /data/buildslaves/Linux_64bit_DEBUG/mongo/mongod(_ZN5mongo12DBClientBase5queryERKSsNS_5QueryEiiPKNS_7BSONObjEii+0xe9) [0xc467c1]
       /data/buildslaves/Linux_64bit_DEBUG/mongo/mongod(_ZN5mongo14DBDirectClient5queryERKSsNS_5QueryEiiPKNS_7BSONObjEii+0x6e) [0xebadce]
       /data/buildslaves/Linux_64bit_DEBUG/mongo/mongod(_ZN5mongo5Scope10loadStoredEb+0x193) [0x116b3d3]
       /data/buildslaves/Linux_64bit_DEBUG/mongo/mongod(_ZN5mongo11PooledScope10loadStoredEb+0x3e) [0x116d5e4]
       /data/buildslaves/Linux_64bit_DEBUG/mongo/mongod(_ZN5mongo12ScriptEngine14getPooledScopeERKSsS2_+0x206) [0x116c260]
       /data/buildslaves/Linux_64bit_DEBUG/mongo/mongod(_ZN5mongo20WhereMatchExpression4initERKNS_10StringDataES3_RKNS_7BSONObjE+0x286) [0xef9596]
      Wed Jul 10 17:32:07.637 [conn81] 
      ***aborting after fassert() failure
       
      ********** Parallel Test FAILED: Error: error loading js file: jstests/geo_s2nearComplex.js
      ********** Parallel Test FAILED: Error: error loading js file: jstests/sortm.js
      ********** Parallel Test FAILED: Error: error loading js file: jstests/use_power_of_2.js
      ********** Parallel Test FAILED: Error: error loading js file: jstests/constructors.js
      assert: [0] != [4] are not equal : one or more tests failed

        Attachments

          Issue Links

            Activity

              People

              Assignee:
              redbeard0531 Mathias Stearn
              Reporter:
              matt.kangas Matt Kangas
              Participants:
              Votes:
              0 Vote for this issue
              Watchers:
              3 Start watching this issue

                Dates

                Created:
                Updated:
                Resolved: