Uploaded image for project: 'Core Server'
  1. Core Server
  2. SERVER-27436

rocksdb (mongo-rocks) compilation failure

    XMLWordPrintableJSON

Details

    • Icon: Task Task
    • Resolution: Done
    • Icon: Major - P3 Major - P3
    • None
    • None
    • Storage
    • None
    • Storage 2017-01-23
    • 0

    Description

      compile failed on ubuntu1404-rocksdb

      Project: mongodb-mongo-master

      [2016/12/14 21:32:38.911] /opt/mongodbtoolchain/v2/bin/g++ -o build/release/mongo/executor/network_interface_asio_integration_test.o -c -Woverloaded-virtual -Wno-maybe-uninitialized -std=c++11 -fno-omit-frame-pointer -fno-strict-aliasing -ggdb -pthread -Wall -Wsign-compare -Wno-unknown-pragmas -Winvalid-pch -Werror -O2 -Wno-unused-local-typedefs -Wno-unused-function -Wno-deprecated-declarations -Wno-unused-but-set-variable -Wno-missing-braces -fno-builtin-memcmp -DPCRE_STATIC -DNDEBUG -DBOOST_THREAD_VERSION=4 -DBOOST_THREAD_DONT_PROVIDE_VARIADIC_THREAD -DBOOST_SYSTEM_NO_DEPRECATED -DBOOST_MATH_NO_LONG_DOUBLE_MATH_FUNCTIONS -DBOOST_THREAD_DONT_PROVIDE_INTERRUPTIONS -DBOOST_THREAD_HAS_NO_EINTR_BUG -Isrc/third_party/asio-asio-1-11-0/asio/include -Isrc/third_party/s2 -Isrc/third_party/pcre-8.39 -Isrc/third_party/boost-1.60.0 -I/data/mci/9e6bd8ac176d65be8d0edd31b76291d8/rocksdb/include -Ibuild/release -Isrc src/mongo/executor/network_interface_asio_integration_test.cpp
      [2016/12/14 21:32:39.767] /opt/mongodbtoolchain/v2/bin/g++ -o build/release/mongo/executor/network_interface_perf_test.o -c -Woverloaded-virtual -Wno-maybe-uninitialized -std=c++11 -fno-omit-frame-pointer -fno-strict-aliasing -ggdb -pthread -Wall -Wsign-compare -Wno-unknown-pragmas -Winvalid-pch -Werror -O2 -Wno-unused-local-typedefs -Wno-unused-function -Wno-deprecated-declarations -Wno-unused-but-set-variable -Wno-missing-braces -fno-builtin-memcmp -DPCRE_STATIC -DNDEBUG -DBOOST_THREAD_VERSION=4 -DBOOST_THREAD_DONT_PROVIDE_VARIADIC_THREAD -DBOOST_SYSTEM_NO_DEPRECATED -DBOOST_MATH_NO_LONG_DOUBLE_MATH_FUNCTIONS -DBOOST_THREAD_DONT_PROVIDE_INTERRUPTIONS -DBOOST_THREAD_HAS_NO_EINTR_BUG -Isrc/third_party/asio-asio-1-11-0/asio/include -Isrc/third_party/s2 -Isrc/third_party/pcre-8.39 -Isrc/third_party/boost-1.60.0 -I/data/mci/9e6bd8ac176d65be8d0edd31b76291d8/rocksdb/include -Ibuild/release -Isrc src/mongo/executor/network_interface_perf_test.cpp
      [2016/12/14 21:32:39.964] scons: *** [build/release/mongo/db/modules/rocksdb/src/rocks_record_store_test.o] Error 1
      [2016/12/14 21:32:40.032] src/mongo/db/modules/rocksdb/src/rocks_index_test.cpp: In member function 'virtual void mongo::UnitTest__RocksIndexTest__Isolation::_doTest()':
      [2016/12/14 21:32:40.032] src/mongo/db/modules/rocksdb/src/rocks_index_test.cpp:106:31: error: 'class mongo::HarnessHelper' has no member named 'newSortedDataInterface'
      [2016/12/14 21:32:40.033]          sorted(harnessHelper->newSortedDataInterface(true));
      [2016/12/14 21:32:40.033]                                ^
      [2016/12/14 21:32:40.062] src/mongo/db/modules/rocksdb/src/rocks_index_test.cpp: In function 'void mongo::testSeekExactRemoveNext(bool, bool)':
      [2016/12/14 21:32:40.062] src/mongo/db/modules/rocksdb/src/rocks_index_test.cpp:172:38: error: 'class mongo::HarnessHelper' has no member named 'newSortedDataInterface'
      [2016/12/14 21:32:40.062]          auto sorted = harnessHelper->newSortedDataInterface(unique,
      [2016/12/14 21:32:40.062]                                       ^
      [2016/12/14 21:32:41.478] scons: *** [build/release/mongo/db/modules/rocksdb/src/rocks_index_test.o] Error 1
      

      BF Ticket Generated by jonathan.abrahams

      Attachments

        Activity

          People

            milkie@mongodb.com Eric Milkie
            milkie@mongodb.com Eric Milkie
            Votes:
            0 Vote for this issue
            Watchers:
            6 Start watching this issue

            Dates

              Created:
              Updated:
              Resolved: