Details
-
Build Failure
-
Status: Open
-
Major - P3
-
Resolution: Unresolved
-
None
-
None
-
None
Description
many-collection-test on large-scale-tests
Host: i-0e17422c74789db46
Project: wiredtiger-mongo-v5.0
Commit: babc2b51
Task Logs:
many-collection-test task_log
Logs:
Failure keywords
|
[576/5489] Compiled build/opt/mongo/db/catalog/collection_uuid_mismatch_info.dyn.o
|
[590/5489] Compiled build/opt/mongo/db/catalog/collection_uuid_mismatch.dyn.o
|
Link: https://evergreen.mongodb.com/task_log_raw/wiredtiger_mongo_v5.0_large_scale_tests_many_collection_test_638834d33627e0534c4be322_22_12_01_05_00_03/0?type=T#L1189
|
|
Test Failure message
|
FAILED: build/opt/mongo/db/storage/wiredtiger/wiredtiger_begin_transaction_block.dyn.o
|
|
Link: https://evergreen.mongodb.com/task_log_raw/wiredtiger_mongo_v5.0_large_scale_tests_many_collection_test_638834d33627e0534c4be322_22_12_01_05_00_03/0?type=T#L2757
|
|
Compiler and other error messages
|
src/mongo/db/storage/wiredtiger/wiredtiger_begin_transaction_block.cpp:98:19: error: 'WT_SESSION' {aka 'struct __wt_session'} has no member named 'timestamp_transaction_uint'; did you mean 'timestamp_transaction'?
|
Link: https://evergreen.mongodb.com/task_log_raw/wiredtiger_mongo_v5.0_large_scale_tests_many_collection_test_638834d33627e0534c4be322_22_12_01_05_00_03/0?type=T#L2760
|
|
Compiler and other error messages
|
src/mongo/db/storage/wiredtiger/wiredtiger_begin_transaction_block.cpp:98:56: error: 'WT_TS_TXN_TYPE_READ' was not declared in this scope
|
Link: https://evergreen.mongodb.com/task_log_raw/wiredtiger_mongo_v5.0_large_scale_tests_many_collection_test_638834d33627e0534c4be322_22_12_01_05_00_03/0?type=T#L2764
|