Uploaded image for project: 'WiredTiger'
  1. WiredTiger
  2. WT-10408

Task timeout in cppsuite-operations-test-stress-nonstandalone

    • Type: Icon: Build Failure Build Failure
    • Resolution: Cannot Reproduce
    • Priority: Icon: Major - P3 Major - P3
    • None
    • Affects Version/s: None
    • Component/s: None
    • BermudaTriangle- 2023-09-05

      cppsuite-operations-test-stress-nonstandalone on cppsuite-stress-tests-ubuntu

      Host: i-053532fb6390674d2
      Project: wiredtiger
      Commit: e9069c3e

      Task Logs:

      cppsuite-operations-test-stress-nonstandalone task_log

      Logs:

      02, 0): Invalid argument
      [1671408058:350052][4781:0x7f781720d700], WT_SESSION.commit_transaction: [WT_VERB_DEFAULT][ERROR]: __wt_txn_validate_commit_timestamp, 544: commit timestamp (201, 60816) must be after the stable timestamp (202, 0): Invalid argument
      [1671408058:350168][4781:0x7f781fa1e700], WT_SESSION.commit_transaction: [WT_VERB_DEFAULT][ERROR]: __wt_txn_validate_commit_timestamp, 544: commit timestamp (200, 60172) must be after the stable timestamp (202, 0): Invalid argument
      [1671408058:349803][4781:0x7f78081ef700], WT_SESSION.commit_transaction: [WT_VERB_DEFAULT][ERROR]: __wt_txn_validate_commit_timestamp, 544: commit timestamp (201, 60766) must be after the stable timestamp (202, 0): Invalid argument
      [1671408061:224651][4781:0x7f780b9f6700], WT_SESSION.commit_transaction: [WT_VERB_DEFAULT][ERROR]: __wt_txn_validate_commit_timestamp, 544: commit timestamp (203, 60916) must be after the stable timestamp (205, 0): Invalid argument
      [1671408061:224887][4781:0x7f783624b700], WT_SESSION.commit_transaction: [WT_VERB_DEFAULT][ERROR]: __wt_txn_validate_commit_timestamp, 544: commit timestamp (203, 60869) must be after the stable timestamp (205, 0): Invalid argument
      [1671408064:698199][4781:0x7f77fc9d8700], WT_SESSION.commit_transaction: [WT_VERB_DEFAULT][ERROR]: __wt_txn_validate_commit_timestamp, 544: commit timestamp (207, 61441) must be after the stable timestamp (208, 0): Invalid argument
      [1671408064:699452][4781:0x7f7822a24700], WT_SESSION.commit_transaction: [WT_VERB_DEFAULT][ERROR]: __wt_txn_validate_commit_timestamp, 544: commit timestamp (205, 61306) must be after the stable timestamp (208, 0): Invalid argument
      [1671408064:701005][4781:0x7f7821a22700], WT_SESSION.commit_transaction: [WT_VERB_DEFAULT][ERROR]: __wt_txn_validate_commit_timestamp, 544: commit timestamp (203, 60839) must be after the stable timestamp (208, 0): Invalid argument
      [1671408064:701499][4781:0x7f77fc1d7700], WT_SESSION.commit_transaction: [WT_VERB_DEFAULT][ERROR]: __wt_txn_validate_commit_timestamp, 544: commit timestamp (203, 60956) must be after the stable timestamp (208, 0): Invalid argument
      [1671408064:701768][4781:0x7f783d259700], WT_SESSION.commit_transaction: [WT_VERB_DEFAULT][ERROR]: __wt_txn_validate_commit_timestamp, 544: commit timestamp (205, 61319) must be after the stable timestamp (208, 0): Invalid argument
      [1671408064:702090][4781:0x7f7825a2a700], WT_SESSION.commit_transaction: [WT_VERB_DEFAULT][ERROR]: __wt_txn_validate_commit_timestamp, 544: commit timestamp (205, 61305) must be after the stable timestamp (208, 0): Invalid argument
      [1671408064:702138][4781:0x7f78041e7700], WT_SESSION.commit_transaction: [WT_VERB_DEFAULT][ERROR]: __wt_txn_validate_commit_timestamp, 544: commit timestamp (205, 61301) must be after the stable timestamp (208, 0): Invalid argument
      [1671408064:702141][4781:0x7f77fa9d4700], WT_SESSION.commit_transaction: [WT_VERB_DEFAULT][ERROR]: __wt_txn_validate_commit_timestamp, 544: commit timestamp (204, 61107) must be after the stable timestamp (208, 0): Invalid argument
      [1671408064:703240][4781:0x7f7833a46700], WT_SESSION.commit_transaction: [WT_VERB_DEFAULT][ERROR]: __wt_txn_validate_commit_timestamp, 544: commit timestamp (207, 61649) must be after the stable timestamp (208, 0): Invalid argument
      [1671408064:703416][4781:0x7f77fe1db700], WT_SESSION.commit_transaction: [WT_VERB_DEFAULT][ERROR]: __wt_txn_validate_commit_timestamp, 544: commit timestamp (202, 60833) must be after the stable timestamp (208, 0): Invalid argument
      [1671408064:703560][4781:0x7f77f61cb700], WT_SESSION.commit_transaction: [WT_VERB_DEFAULT][ERROR]: __wt_txn_validate_commit_timestamp, 544: commit timestamp (204, 61018) must be after the stable timestamp (208, 0): Invalid argument
      [1671408064:703581][4781:0x7f7831241700], WT_SESSION.commit_transaction: [WT_VERB_DEFAULT][ERROR]: __wt_txn_validate_commit_timestamp, 544: commit timestamp (207, 61674) must be after the stable timestamp (208, 0): Invalid argument
      [1671408065:722609][4781:0x7f7826a2c700], WT_SESSION.commit_transaction: [WT_VERB_DEFAULT][ERROR]: __wt_txn_validate_commit_timestamp, 544: commit timestamp (205, 61299) must be after the stable timestamp (209, 0): Invalid argument
      [1671408065:722692][4781:0x7f77ee9bc700], WT_SESSION.commit_transaction: [WT_VERB_DEFAULT][ERROR]: __wt_txn_validate_commit_timestamp, 544: commit timestamp (205, 61389) must be after the stable timestamp (209, 0): Invalid argument
      [1671408065:724195][4781:0x7f77e79ae700], WT_SESSION.commit_transaction: [WT_VERB_DEFAULT][ERROR]: __wt_txn_validate_commit_timestamp, 544: commit timestamp (205, 61396) must be after the stable timestamp (209, 0): Invalid argument
      [1671408065:724611][4781:0x7f7844267700], WT_SESSION.commit_transaction: [WT_VERB_DEFAULT][ERROR]: __wt_txn_validate_commit_timestamp, 544: commit timestamp (205, 61335) must be after the stable timestamp (209, 0): Invalid argument
      [1671408065:725379][4781:0x7f7816a0c700], WT_SESSION.commit_transaction: [WT_VERB_DEFAULT][ERROR]: __wt_txn_validate_commit_timestamp, 544: commit timestamp (205, 61401) must be after the stable timestamp (209, 0): Invalid argument
      [1671408065:725760][4781:0x7f77e49a8700], WT_SESSION.commit_transaction: [WT_VERB_DEFAULT][ERROR]: __wt_txn_validate_commit_timestamp, 544: commit timestamp (205, 61403) must be after the stable timestamp (209, 0): Invalid argument
      [1671408065:726072][4781:0x7f7841a62700], WT_SESSION.commit_transaction: [WT_VERB_DEFAULT][ERROR]: __wt_txn_validate_commit_timestamp, 544: commit timestamp (205, 61318) must be after the stable timestamp (209, 0): Invalid argument
      [1671408065:726454][4781:0x7f78009e0700], WT_SESSION.commit_transaction: [WT_VERB_DEFAULT][ERROR]: __wt_txn_validate_commit_timestamp, 544: commit timestamp (205, 61414) must be after the stable timestamp (209, 0): Invalid argument
      [1671408065:726576][4781:0x7f7835249700], WT_SESSION.commit_transaction: [WT_VERB_DEFAULT][ERROR]: __wt_txn_validate_commit_timestamp, 544: commit timestamp (201, 60625) must be after the stable timestamp (209, 0): Invalid argument
      [1671408065:726610][4781:0x7f77e39a6700], WT_SESSION.commit_transaction: [WT_VERB_DEFAULT][ERROR]: __wt_txn_validate_commit_timestamp, 544: commit timestamp (207, 61420) must be after the stable timestamp (209, 0): Invalid argument
      [1671408065:726916][4781:0x7f77f71cd700], WT_SESSION.commit_transaction: [WT_VERB_DEFAULT][ERROR]: __wt_txn_validate_commit_timestamp, 544: commit timestamp (205, 61304) must be after the stable timestamp (209, 0): Invalid argument
      [1671408065:727600][4781:0x7f782c237700], WT_SESSION.commit_transaction: [WT_VERB_DEFAULT][ERROR]: __wt_txn_validate_commit_timestamp, 544: commit timestamp (205, 61408) must be after the stable timestamp (209, 0): Invalid argument
      [1671408065:727789][4781:0x7f782d239700], WT_SESSION.commit_transaction: [WT_VERB_DEFAULT][ERROR]: __wt_txn_validate_commit_timestamp, 544: commit timestamp (204, 61036) must be after the stable timestamp (209, 0): Invalid argument
      [1671408065:728044][4781:0x7f780a1f3700], WT_SESSION.commit_transaction: [WT_VERB_DEFAULT][ERROR]: __wt_txn_validate_commit_timestamp, 544: commit timestamp (205, 61267) must be after the stable timestamp (209, 0): Invalid argument
      [1671408065:728242][4781:0x7f783fa5e700], WT_SESSION.commit_transaction: [WT_VERB_DEFAULT][ERROR]: __wt_txn_validate_commit_timestamp, 544: commit timestamp (207, 61431) must be after the stable timestamp (209, 0): Invalid argument
      [1671408065:728420][4781:0x7f77e41a7700], WT_SESSION.commit_transaction: [WT_VERB_DEFAULT][ERROR]: __wt_txn_validate_commit_timestamp, 544: commit timestamp (204, 61124) must be after the stable timestamp (209, 0): Invalid argument
      [1671408065:729063][4781:0x7f7825229700], WT_SESSION.commit_transaction: [WT_VERB_DEFAULT][ERROR]: __wt_txn_validate_commit_timestamp, 544: commit timestamp (207, 61689) must be after the stable timestamp (209, 0): Invalid argument
      [1671408065:729686][4781:0x7f77ee1bb700], WT_SESSION.commit_transaction: [WT_VERB_DEFAULT][ERROR]: __wt_txn_validate_commit_timestamp, 544: commit timestamp (205, 61413) must be after the stable timestamp (209, 0): Invalid argument
      [1671408070:13913][4781:0x7f781ba16700], WT_SESSION.commit_transaction: [WT_VERB_DEFAULT][ERROR]: __wt_txn_validate_commit_timestamp, 544: commit timestamp (207, 61515) must be after the stable timestamp (213, 0): Invalid argument
      [1671408071:35184][4781:0x7f77e71ad700], WT_SESSION.commit_transaction: [WT_VERB_DEFAULT][ERROR]: __wt_txn_validate_commit_timestamp, 544: commit timestamp (207, 61624) must be after the stable timestamp (214, 0): Invalid argument
      [1671408071:35591][4781:0x7f781e21b700], WT_SESSION.commit_transaction: [WT_VERB_DEFAULT][ERROR]: __wt_txn_validate_commit_timestamp, 544: commit timestamp (204, 61037) must be after the stable timestamp (214, 0): Invalid argument
      [1671408071:35656][4781:0x7f7832243700], WT_SESSION.commit_transaction: [WT_VERB_DEFAULT][ERROR]: __wt_txn_validate_commit_timestamp, 544: commit timestamp (207, 61639) must be after the stable timestamp (214, 0): Invalid argument
      [1671408071:35739][4781:0x7f783da5a700], WT_SESSION.commit_transaction: [WT_VERB_DEFAULT][ERROR]: __wt_txn_validate_commit_timestamp, 544: commit timestamp (203, 60849) must be after the stable timestamp (214, 0): Invalid argument
      [1671408071:35813][4781:0x7f78001df700], WT_SESSION.commit_transaction: [WT_VERB_DEFAULT][ERROR]: __wt_txn_validate_commit_timestamp, 544: commit timestamp (205, 61300) must be after the stable timestamp (214, 0): Invalid argument
      [1671408071:35862][4781:0x7f7833245700], WT_SESSION.commit_transaction: [WT_VERB_DEFAULT][ERROR]: __wt_txn_validate_commit_timestamp, 544: commit timestamp (205, 61397) must be after the stable timestamp (214, 0): Invalid argument
      [1671408071:35882][4781:0x7f77f
      Link: https://evergreen.mongodb.com/task_log_raw/wiredtiger_cppsuite_stress_tests_ubuntu_cppsuite_operations_test_stress_nonstandalone_e9069c3e5fd23c16d16e7f62f8b4d3ac2327d24a_22_12_18_23_52_50/0?type=T#L26
      

      logs

            Assignee:
            backlog-server-storage-engines Backlog - Storage Engines Team
            Reporter:
            Xgen-BuildBaron-User xgen-buildbaron-user
            Votes:
            0 Vote for this issue
            Watchers:
            3 Start watching this issue

              Created:
              Updated:
              Resolved: