Uploaded image for project: 'WiredTiger'
  1. WiredTiger
  2. WT-10803

WT_ROLLBACK in test_wt8246_compact_rts_data_correctness

    • Type: Icon: Build Failure Build Failure
    • Resolution: Duplicate
    • Priority: Icon: Major - P3 Major - P3
    • None
    • Affects Version/s: None
    • Component/s: None
    • Labels:

      make-check-test on macos-1014

      Host: macos-1014-132.macstadium.build.10gen.cc
      Project: wiredtiger-mongo-v6.0
      Commit: 021ffc6c

      Task Logs:

      make-check-test task_log

      Logs:

       96/103 Test  #94: test_wt8246_compact_rts_data_correctness .........***Exception: Child aborted439.76 sec
      

      logs

      make-check-test task_log

      Logs:

      test_wt8246_compact_rts_data_correctness: FAILED: void large_updates(WT_SESSION *, const char *, char *, int)/351: cursor->insert(cursor): WT_ROLLBACK: conflict between concurrent operations
      
      

      logs

      make-check-test task_log

      Logs:

      test_wt8246_compact_rts_data_correctness: process aborting
      WiredTiger Error: void __wt_abort(WT_SESSION_IMPL *), 28: aborting WiredTiger library
      

      logs

      make-check-test task_log

      Logs:

      test_wt8246_compact_rts_data_correctness: FAILED: Child process 14542 abnormally exited: Invalid argument
      
      

      logs

      make-check-test task_log

      Logs:

      test_wt8246_compact_rts_data_correctness: process aborting
      WiredTiger Error: void __wt_abort(WT_SESSION_IMPL *), 28: aborting WiredTiger library
      

      logs

      make-check-test task_log

      Logs:

      The following tests FAILED:
      
      

      logs

            Assignee:
            backlog-server-storage-engines [DO NOT USE] Backlog - Storage Engines Team
            Reporter:
            Xgen-BuildBaron-User xgen-buildbaron-user
            Votes:
            0 Vote for this issue
            Watchers:
            2 Start watching this issue

              Created:
              Updated:
              Resolved: