Uploaded image for project: 'WiredTiger'
  1. WiredTiger
  2. WT-10910

failed: make-check-nonstandalone on ubuntu2004 [wiredtiger @ 8720a0b3]

    • Type: Icon: Build Failure Build Failure
    • Resolution: Duplicate
    • Priority: Icon: Major - P3 Major - P3
    • None
    • Affects Version/s: None
    • Component/s: None
    • Labels:

      make-check-nonstandalone on ubuntu2004

      Host: i-08a8ca8dad671d352
      Project: wiredtiger
      Commit: 8720a0b3

      Task Logs:

      make-check-nonstandalone task_log

      Logs:

       97/109 Test #102: test_wt10897_compact_quick_interrupt .............Subprocess aborted***Exception:  79.65 sec
      

      logs

      make-check-nonstandalone task_log

      Logs:

      [1681245306:683235][37283:0x7f86582f3c40], file:compact.wt, WT_SESSION.compact: [WT_VERB_DEFAULT][ERROR]: __wt_compact, 355: compact interrupted by application: WT_ERROR: non-specific WiredTiger error
      
      

      logs

      make-check-nonstandalone task_log

      Logs:

      test_wt10897_compact_quick_interrupt: FAILED: main/219: difftime(end, start) < 3
      
      

      logs

      make-check-nonstandalone task_log

      Logs:

      test_wt10897_compact_quick_interrupt: process aborting
      WiredTiger Error: __wt_abort, 28: aborting WiredTiger library
      

      logs

      make-check-nonstandalone task_log

      Logs:

      The following tests FAILED:
      
      

      logs

            Assignee:
            peter.macko@mongodb.com Peter Macko
            Reporter:
            Xgen-BuildBaron-User xgen-buildbaron-user
            Votes:
            0 Vote for this issue
            Watchers:
            3 Start watching this issue

              Created:
              Updated:
              Resolved: