Uploaded image for project: 'WiredTiger'
  1. WiredTiger
  2. WT-11002

failed: unit-test-macos on macos-1014 [wiredtiger-mongo-v6.0 @ 01c4ea40]

    • Type: Icon: Build Failure Build Failure
    • Resolution: Unresolved
    • Priority: Icon: Major - P3 Major - P3
    • None
    • Affects Version/s: None
    • Component/s: None
    • StorEng - Refinement Pipeline

      unit-test-macos on macos-1014

      Host: macos-1014-154.macstadium.build.10gen.cc
      Project: wiredtiger-mongo-v6.0
      Commit: 01c4ea40

      Task Logs:

      unit-test-macos task_log

      Logs:

      "[1682645609:969858][30038:0x108af55c0], test_cursor_random.test_cursor_random.test_cursor_random_deleted_partial(table.not-sample), file:random_cgroup2.wt, WT_CURSOR.insert: [WT_VERB_DEFAULT][ERROR]: int __wt_cursor_kv_not_set(WT_CURSOR *, _Bool), 226: requires key be set: Invalid argument
      
      

      logs

      unit-test-macos task_log

      Logs:

      [pid:30011]: ERROR: test_cursor_random.test_cursor_random.test_cursor_random_deleted_partial(table.not-sample)
      ----------------------------------------------------------------------
      [pid:30011]: testtools.testresult.real._StringException: Traceback (most recent call last):
        File "/data/mci/bdd9d13d49c55836cbb39388016e68af/wiredtiger/test/suite/test_cursor_random.py", line 155, in test_cursor_random_deleted_partial
          ds.populate()
        File "/data/mci/bdd9d13d49c55836cbb39388016e68af/wiredtiger/test/suite/wtdataset.py", line 78, in populate
          self.fill()
        File "/data/mci/bdd9d13d49c55836cbb39388016e68af/wiredtiger/test/suite/wtdataset.py", line 65, in fill
          self.store_range(1, self.rows)
        File "/data/mci/bdd9d13d49c55836cbb39388016e68af/wiredtiger/test/suite/wtdataset.py", line 61, in store_range
          self.store_one_cursor(c, i)
        File "/data/mci/bdd9d13d49c55836cbb39388016e68af/wiredtiger/test/suite/wtdataset.py", line 52, in store_one_cursor
          c[self.key(i)] = self.value(i)
        File "/data/mci/bdd9d13d49c55836cbb39388016e68af/wiredtiger/cmake_build/lang/python/wiredtiger/swig_wiredtiger.py", line 320, in __setitem__
          if self.insert() != 0:
      _wiredtiger.WiredTigerError: Invalid argument
      ======================================================================
      [pid:30011]: ERROR: test_prepare_hs01.test_prepare_hs01.test_prepare_hs(column)
      ----------------------------------------------------------------------
      [pid:30011]: testtools.testresult.real._StringException: Traceback (most recent call last):
        File "/data/mci/bdd9d13d49c55836cbb39388016e68af/wiredtiger/test/suite/test_prepare_hs01.py", line 152, in test_prepare_hs
          self.prepare_updates(uri, ds, nrows, nsessions, nkeys)
        File "/data/mci/bdd9d13d49c55836cbb39388016e68af/wiredtiger/test/suite/test_prepare_hs01.py", line 112, in prepare_updates
          self.check(uri, ds, nrows, nsessions, nkeys, 2, bigvalue1, bigvalue2)
        File "/data/mci/bdd9d13d49c55836cbb39388016e68af/wiredtiger/test/suite/test_prepare_hs01.py", line 52, in check
          self.assertEquals(cursor.search(), 0)
      _wiredtiger.WiredTigerError: WT_ROLLBACK: conflict between concurrent operations
      ----------------------------------------------------------------------
      Ran 8982 tests in 9875.517s
      

      logs

      unit-test-macos task_log

      Logs:

      AssertionError: unexpected error output, contains: "[1682645609:969858][30038:0x108af55c0], test_cursor_random.test_cursor_random.test_cursor_random_deleted_partial(table.not-sample), file:random_cgroup2.wt, WT_CURSOR.insert: [WT_VERB_DEFAULT][ERROR]: int __wt_cursor_kv_not_set(WT_CURSOR *, _Bool), 226: requires key be set: Invalid argument
      [1682645609:969858][30038:0x108af55c0], test_cursor_random.test_cursor_random.test_cursor_random_deleted_partial(table.not-sample), file:random_cgroup2.wt, WT_CURSOR.insert: [WT_VERB_DEFAULT][ERROR]: int __wt_cursor_kv_not_set(WT_CURSOR *, _Bool), 226: requires key be set: Invalid argument
      

      logs

            Assignee:
            backlog-server-storage-engines [DO NOT USE] Backlog - Storage Engines Team
            Reporter:
            Xgen-BuildBaron-User xgen-buildbaron-user
            Votes:
            0 Vote for this issue
            Watchers:
            2 Start watching this issue

              Created:
              Updated: