-
Type:
Build Failure
-
Resolution: Gone away
-
Priority:
Major - P3
-
None
-
Affects Version/s: None
-
Component/s: Cursors
spinlock-gcc-test on ubuntu2004
Host: i-0a3c4f3f88f847a19
Project: wiredtiger-mongo-v6.0
Commit: c677b2cd
Task Logs:
spinlock-gcc-test task_log
Logs:
[pid:46454]: FAIL: test_cursor13.test_cursor13_reopens.test_reconfig(file.enable.none) ---------------------------------------------------------------------- [pid:46454]: testtools.testresult.real._StringException: Traceback (most recent call last): File "/data/mci/c15c56478af3c723587fe6ea434e79e9/wiredtiger/test/suite/test_cursor13.py", line 259, in test_reconfig self.basic_reopen(10, True, caching) File "/data/mci/c15c56478af3c723587fe6ea434e79e9/wiredtiger/test/suite/test_cursor13.py", line 218, in basic_reopen self.assert_cursor_reopened(caching_enabled and (opens != 0 or create)) File "/data/mci/c15c56478af3c723587fe6ea434e79e9/wiredtiger/test/suite/test_cursor13.py", line 106, in assert_cursor_reopened self.assertGreater(stats[1], self.stat_cursor_reopen) File "/opt/mongodbtoolchain/revisions/11316f1e7b36f08dcdd2ad0640af18f9287876f4/stow/python3-v3.4fA/lib/python3.9/unittest/case.py", line 1229, in assertGreater self.fail(self._formatMessage(msg, standardMsg)) File "/opt/mongodbtoolchain/revisions/11316f1e7b36f08dcdd2ad0640af18f9287876f4/stow/python3-v3.4fA/lib/python3.9/unittest/case.py", line 670, in fail raise self.failureException(msg) AssertionError: 3 not greater than 3 ---------------------------------------------------------------------- Ran 8987 tests in 1630.638s