Uploaded image for project: 'WiredTiger'
  1. WiredTiger
  2. WT-11917

failed: long-test on ubuntu2004 [wiredtiger-mongo-v5.0 @ 44381ae4]

    • Type: Icon: Build Failure Build Failure
    • Resolution: Unresolved
    • Priority: Icon: Major - P3 Major - P3
    • None
    • Affects Version/s: None
    • Component/s: None
    • Labels:
    • StorEng - Defined Pipeline

      long-test on ubuntu2004

      Host: i-095e978d5e3058f8f
      Project: wiredtiger-mongo-v5.0
      Commit: 44381ae4

      Task Logs:

      long-test task_log

      Logs:

      # XFAIL: 0
      # FAIL:  0
      # XPASS: 0
      # ERROR: 0
      ============================================================================
      make[3]: Leaving directory '/data/mci/80d2994ccae259ed90a399dfb03e4057/wiredtiger/build_posix/examples/c'
      make[2]: Leaving directory '/data/mci/80d2994ccae259ed90a399dfb03e4057/wiredtiger/build_posix/examples/c'
      make[1]: Leaving directory '/data/mci/80d2994ccae259ed90a399dfb03e4057/wiredtiger/build_posix/examples/c'
      Making check in test/bloom
      make[1]: Entering directory '/data/mci/80d2994ccae259ed90a399dfb03e4057/wiredtiger/build_posix/test/bloom'
      make  check-TESTS
      make[2]: Entering directory '/data/mci/80d2994ccae259ed90a399dfb03e4057/wiredtiger/build_posix/test/bloom'
      make[3]: Entering directory '/data/mci/80d2994ccae259ed90a399dfb03e4057/wiredtiger/build_posix/test/bloom'
      PASS: t
      ============================================================================
      Testsuite summary for WiredTiger 10.0.2
      ============================================================================
      # TOTAL: 1
      # PASS:  1
      # SKIP:  0
      # XFAIL: 0
      # FAIL:  0
      # XPASS: 0
      # ERROR: 0
      ============================================================================
      make[3]: Leaving directory '/data/mci/80d2994ccae259ed90a399dfb03e4057/wiredtiger/build_posix/test/bloom'
      make[2]: Leaving directory '/data/mci/80d2994ccae259ed90a399dfb03e4057/wiredtiger/build_posix/test/bloom'
      make[1]: Leaving directory '/data/mci/80d2994ccae259ed90a399dfb03e4057/wiredtiger/build_posix/test/bloom'
      Making check in test/checkpoint
      make[1]: Entering directory '/data/mci/80d2994ccae259ed90a399dfb03e4057/wiredtiger/build_posix/test/checkpoint'
      make  check-TESTS
      make[2]: Entering directory '/data/mci/80d2994ccae259ed90a399dfb03e4057/wiredtiger/build_posix/test/checkpoint'
      make[3]: Entering directory '/data/mci/80d2994ccae259ed90a399dfb03e4057/wiredtiger/build_posix/test/checkpoint'
      PASS: smoke.sh
      ============================================================================
      Testsuite summary for WiredTiger 10.0.2
      ============================================================================
      # TOTAL: 1
      # PASS:  1
      # SKIP:  0
      # XFAIL: 0
      # FAIL:  0
      # XPASS: 0
      # ERROR: 0
      ============================================================================
      make[3]: Leaving directory '/data/mci/80d2994ccae259ed90a399dfb03e4057/wiredtiger/build_posix/test/checkpoint'
      make[2]: Leaving directory '/data/mci/80d2994ccae259ed90a399dfb03e4057/wiredtiger/build_posix/test/checkpoint'
      make[1]: Leaving directory '/data/mci/80d2994ccae259ed90a399dfb03e4057/wiredtiger/build_posix/test/checkpoint'
      Making check in test/cppsuite
      make[1]: Entering directory '/data/mci/80d2994ccae259ed90a399dfb03e4057/wiredtiger/build_posix/test/cppsuite'
      make  check-TESTS
      make[2]: Entering directory '/data/mci/80d2994ccae259ed90a399dfb03e4057/wiredtiger/build_posix/test/cppsuite'
      make[3]: Entering directory '/data/mci/80d2994ccae259ed90a399dfb03e4057/wiredtiger/build_posix/test/cppsuite'
      PASS: csuite_style_example_test
      PASS: run
      ============================================================================
      Testsuite summary for WiredTiger 10.0.2
      ============================================================================
      # TOTAL: 2
      # PASS:  2
      # SKIP:  0
      # XFAIL: 0
      # FAIL:  0
      # XPASS: 0
      # ERROR: 0
      ============================================================================
      make[3]: Leaving directory '/data/mci/80d2994ccae259ed90a399dfb03e4057/wiredtiger/build_posix/test/cppsuite'
      make[2]: Leaving directory '/data/mci/80d2994ccae259ed90a399dfb03e4057/wiredtiger/build_posix/test/cppsuite'
      make[1]: Leaving directory '/data/mci/80d2994ccae259ed90a399dfb03e4057/wiredtiger/build_posix/test/cppsuite'
      Making check in test/csuite
      make[1]: Entering directory '/data/mci/80d2994ccae259ed90a399dfb03e4057/wiredtiger/build_posix/test/csuite'
      make  check-TESTS
      make[2]: Entering directory '/data/mci/80d2994ccae259ed90a399dfb03e4057/wiredtiger/build_posix/test/csuite'
      make[3]: Entering directory '/data/mci/80d2994ccae259ed90a399dfb03e4057/wiredtiger/build_posix/test/csuite'
      PASS: tiered_abort/smoke.sh
      PASS: test_scope
      PASS: test_wt1965_col_efficiency
      PASS: truncated_log/smoke.sh
      PASS: test_rwlock
      PASS: test_wt2246_col_append
      PASS: random_directio/smoke.sh
      PASS: wt2447_join_main_table/smoke.sh
      PASS: test_wt2695_checksum
      PASS: test_wt2592_join_schema
      PASS: incr_backup/smoke.sh
      PASS: random_abort/smoke.sh
      PASS: test_wt2719_reconfig
      PASS: test_wt2403_lsm_workload
      PASS: timestamp_abort/smoke.sh
      PASS: test_wt3120_filesys
      PASS: test_wt3135_search_near_collator
      PASS: test_wt3184_dup_index_collator
      PASS: test_wt2999_join_extractor
      PASS: test_wt3363_checkpoint_op_races
      PASS: test_wt3874_pad_byte_collator
      PASS: schema_abort/smoke.sh
      PASS: test_wt4117_checksum
      PASS: test_wt4156_metadata_salvage
      PASS: wt4105_large_doc_small_upd/smoke.sh
      PASS: test_wt4699_json
      PASS: test_wt4333_handle_locks
      PASS: test_wt4891_meta_ckptlist_get_alloc
      PASS: wt2535_insert_race/smoke.sh
      PASS: wt6185_modify_ts/smoke.sh
      PASS: test_wt2834_join_bloom_fix
      ../../../build_posix/gnu-support/test-driver: line 107: 38399 Aborted                 (core dumped) "$@" > $log_file 2>&1
      FAIL: test_wt4803_history_store_abort
      PASS: wt6616_checkpoint_oldest_ts/smoke.sh
      PASS: test_wt2323_join_visibility
      PASS: test_wt3338_partial_update
      PASS: test_wt8057_compact_stress
      PASS: wt2853_perf/smoke.sh
      PASS: test_wt7989_compact_checkpoint
      PASS: wt2909_checkpoint_integrity/smoke.sh
      ===================================================
         WiredTiger 10.0.2: test/csuite/test-suite.log
      ===================================================
      # TOTAL: 39
      # PASS:  38
      # SKIP:  0
      # XFAIL: 0
      # FAIL:  1
      # XPASS: 0
      # ERROR: 0
      .. contents:: :depth: 2
      FAIL: test_wt4803_history_store_abort
      =====================================
      [1698902050:887800][38400:0x7f523a117700], eviction-server: __evict_server, 473: Cache stuck for too long, giving up: Connection timed out: Connection timed out
      Running test command: ./test_wt4803_history_store_abort
      =-=-=-=-=-=-=-=-=-=-=-=-=-=-=-=-=-=-=-=-=-=-=-=-=
      transaction state dump
      current ID: 2475
      last running ID: 2475
      metadata_pinned ID: 2005
      oldest ID: 2005
      durable timestamp: (0, 0)
      oldest timestamp: (0, 0)
      pinned timestamp: (0, 0)
      stable timestamp: (0, 0)
      has_durable_timestamp: no
      has_oldest_timestamp: no
      has_pinned_timestamp: no
      has_stable_timestamp: no
      oldest_is_pinned: no
      stable_is_pinned: no
      checkpoint running: no
      checkpoint generation: 1
      checkpoint pinned ID: 0
      checkpoint txn ID: 0
      session count: 16
      Transaction state of active sessions:
      ID: 0, pinned ID: 2005, metadata pinned ID: 0, name: EMPTY
      transaction id: 0, mod count: 0, snap min: 2005, snap max: 2005, snapshot count: 0, commit_timestamp: (0, 0), durable_timestamp: (0, 0), first_commit_timestamp: (0, 0), prepare_timestamp: (0, 0), pinned_durable_timestamp: (0, 0), read_timestamp: (0, 0), checkpoint LSN: [0][0], full checkpoint: false, rollback reason: , flags: 0x00000808, isolation: WT_ISO_SNAPSHOT
      =-=-=-=-=-=-=-=-=-=-=-=-=-=-=-=-=-=-=-=-=-=-=-=-=
      cache dump
      cache full: no
      cache clean check: no (28.294%)
      cache dirty check: no (10.802%)
      cache updates check: yes (10.801%)
      file:test_wt4803_history_store_abort.wt(<live>):
      internal: 1 pages, 0MB, 0/1 clean/dirty pages, 0/0 clean/dirty MB, 0MB max page, 0MB max dirty page
      leaf: 17 pages, 5MB, 16/1 clean/dirty pages, 0/5/5 clean/dirty/updates MB, 5MB max page, 5MB max dirty page
      file:WiredTigerHS.wt(<live>):
      internal: 1 pages, 0MB, 0/1 clean/dirty pages, 0/0 clean/dirty MB, 0MB max page, 0MB max dirty page
      leaf: 8 pages, 8MB, 8/0 clean/dirty pages, 8/0/0 clean/dirty/updates MB, 1MB max page, 0MB max dirty page
      file:WiredTiger.wt(<live>):
      internal: 1 pages, 0MB, 1/0 clean/dirty pages, 0/0 clean/dirty MB, 0MB max page, 0MB max dirty page
      leaf: 0 pages
      cache dump: total found: 14MB vs tracked inuse 13MB
      total dirty bytes: 5MB vs tracked dirty 5MB
      total updates bytes: 5MB vs tracked updates 5MB
      [1698902050:888329][38400:0x7f523a117700], eviction-server: __wt_evict_thread_run, 344: cache eviction thread error: Connection timed out: Connection timed out
      [1698902050:888336][38400:0x7f523a117700], eviction-server: __wt_evict_thread_run, 344: the process must exit and restart: WT_PANIC: WiredTiger library panic: WT_PANIC: WiredTiger library panic
      [1698902050:888349][38400:0x7f523a117700], eviction-server: __wt_abort, 28: aborting WiredTiger library: Successful return: 0
      Running test command: ./test_wt4803_history_store_abort
      

      logs

      long-test task_log

      Logs:

      test_wt4803_history_store_abort: FAILED: test_hs_workload/171: status == 0
      
      

      logs

      long-test task_log

      Logs:

      test_wt4803_history_store_abort: process aborting
      WiredTiger Error: aborting WiredTiger library
      

      logs

      long-test task_log

      Logs:

      # XFAIL: 0
      # FAIL:  1
      # XPASS: 0
      # ERROR: 0
      ============================================================================
      See test/csuite/test-suite.log
      Please report to support@wiredtiger.com
      ============================================================================
      make[3]: *** [Makefile:1790: test-suite.log] Error 1
      make[3]: Leaving directory '/data/mci/80d2994ccae259ed90a399dfb03e4057/wiredtiger/build_posix/test/csuite'
      make[2]: *** [Makefile:1898: check-TESTS] Error 2
      make[2]: Leaving directory '/data/mci/80d2994ccae259ed90a399dfb03e4057/wiredtiger/build_posix/test/csuite'
      make[1]: *** [Makefile:2237: check-am] Error 2
      make[1]: Leaving directory '/data/mci/80d2994ccae259ed90a399dfb03e4057/wiredtiger/build_posix/test/csuite'
      make: *** [Makefile:2479: check-recursive] Error 1
      Command 'shell.exec' in function 'make check all' (step 4 of 22) failed: shell script encountered problem: exit code 2.
      Finished command 'shell.exec' in function 'make check all' (step 4 of 22) in 30m20.16405851s.
      Running task commands failed: running command: command failed: shell script encountered problem: exit code 2
      Finished running task commands in 33m2.041278916s.
      Task completed - FAILURE.
      Running post-task commands.
      Running command 'archive.targz_pack' in function 'upload artifact' (step 1.1 of 4) in block 'post'.
      Finished command 'archive.targz_pack' in function 'upload artifact' (step 1.1 of 4) in block 'post' in 53.419788947s.
      Running command 's3.put' in function 'upload artifact' (step 1.2 of 4) in block 'post'.
      Putting local file 'wiredtiger.tgz' into path 'build_external/wiredtiger/ubuntu2004/44381ae44de648b8d16779ee15c1165d91a89864/artifacts/long-test_wiredtiger_mongo_v5.0_ubuntu2004_654329515623430d082e5ef5_23_11_02_04_45_05-0.tgz' (https://build_external.s3.amazonaws.com/wiredtiger/ubuntu2004/44381ae44de648b8d16779ee15c1165d91a89864/artifacts/long-test_wiredtiger_mongo_v5.0_ubuntu2004_654329515623430d082e5ef5_23_11_02_04_45_05-0.tgz).
      Performing S3 put to file 'wiredtiger/ubuntu2004/44381ae44de648b8d16779ee15c1165d91a89864/artifacts/long-test_wiredtiger_mongo_v5.0_ubuntu2004_654329515623430d082e5ef5_23_11_02_04_45_05-0.tgz' in bucket 'build_external' (attempt 1 of 5).
      Finished command 's3.put' in function 'upload artifact' (step 1.2 of 4) in block 'post' in 12.80085683s.
      Running command 'archive.targz_pack' in function 'save wt hang analyzer core/debugger files' (step 2.1 of 4) in block 'post'.
      Finished command 'archive.targz_pack' in function 'save wt hang analyzer core/debugger files' (step 2.1 of 4) in block 'post' in 25.77028ms.
      Running command 's3.put' in function 'save wt hang analyzer core/debugger files' (step 2.2 of 4) in block 'post'.
      Putting local file 'wt-hang-analyzer.tgz' into path 'build_external/wiredtiger/ubuntu2004/44381ae44de648b8d16779ee15c1165d91a89864/wt_hang_analyzer/wt-hang-analyzer_long-test_wiredtiger_mongo_v5.0_ubuntu2004_654329515623430d082e5ef5_23_11_02_04_45_05.tgz' (https://build_external.s3.amazonaws.com/wiredtiger/ubuntu2004/44381ae44de648b8d16779ee15c1165d91a89864/wt_hang_analyzer/wt-hang-analyzer_long-test_wiredtiger_mongo_v5.0_ubuntu2004_654329515623430d082e5ef5_23_11_02_04_45_05.tgz).
      Performing S3 put to file 'wiredtiger/ubuntu2004/44381ae44de648b8d16779ee15c1165d91a89864/wt_hang_analyzer/wt-hang-analyzer_long-test_wiredtiger_mongo_v5.0_ubuntu2004_654329515623430d082e5ef5_23_11_02_04_45_05.tgz' in bucket 'build_external' (attempt 1 of 5).
      Command 's3.put' in function 'save wt hang analyzer core/debugger files' (step 2.2 of 4) in block 'post' failed: missing file '/data/mci/80d2994ccae259ed90a399dfb03e4057/wt-hang-analyzer.tgz': opening file '/data/mci/80d2994ccae259ed90a399dfb03e4057/wt-hang-analyzer.tgz': open /data/mci/80d2994ccae259ed90a399dfb03e4057/wt-hang-analyzer.tgz: no such file or directory.
      Finished command 's3.put' in function 'save wt hang analyzer core/debugger files' (step 2.2 of 4) in block 'post' in 25.58321ms.
      Running command 'shell.exec' in function 'dump stderr/stdout' (step 3 of 4) in block 'post'.
      if [ -d "WT_TEST" ]; then
        # Dump stderr/stdout contents generated by the C libraries onto console for Python tests
        find "WT_TEST" -name "std*.txt" ! -empty -exec sh -c "echo 'Contents from {}:'; cat '{}'" \;
      fi
      Finished command 'shell.exec' in function 'dump stderr/stdout' (step 3 of 4) in block 'post' in 921.476┬Ás.
      Running command 'shell.exec' in function 'cleanup' (step 4 of 4) in block 'post'.
      Finished command 'shell.exec' in function 'cleanup' (step 4 of 4) in block 'post' in 713.792327ms.
      Finished running post-task commands in 1m6.987300983s.
      

      logs

            Assignee:
            backlog-server-storage-engines [DO NOT USE] Backlog - Storage Engines Team
            Reporter:
            Xgen-BuildBaron-User xgen-buildbaron-user
            Votes:
            0 Vote for this issue
            Watchers:
            3 Start watching this issue

              Created:
              Updated: