-
Type:
Build Failure
-
Resolution: Unresolved
-
Priority:
Minor - P4
-
None
-
Affects Version/s: None
-
Component/s: None
-
Storage Engines
-
13,868.28
-
StorEng - Defined Pipeline
-
None
-
0
s3-tiered-storage-extensions-test on amazon2-arm64
Host: i-0bfa27dc970b8c9d1
Project: wiredtiger
Commit: 47e5efc0
Task Logs:
s3-tiered-storage-extensions-test task_log
Logs:
"[1739940600:336394][13502:0xffffba4b3690], test_tiered14.test_tiered14.test_tiered(M.string.simple.s3_store), connection: [WT_VERB_EXTENSION][ERROR]: S3ObjectList: ListObjects request to S3 failed.
s3-tiered-storage-extensions-test task_log
Logs:
ERROR: test_tiered14.test_tiered14.test_tiered(M.string.simple.s3_store) (subunit.RemotedTestCase)
test_tiered14.test_tiered14.test_tiered(M.string.simple.s3_store)
----------------------------------------------------------------------
testtools.testresult.real._StringException: Traceback (most recent call last):
File "/data/mci/aa39b5e7b622b64e7c11ecf5e98c35d6/wiredtiger/test/suite/wttest.py", line 233, in _callTestMethod
method()
File "/data/mci/aa39b5e7b622b64e7c11ecf5e98c35d6/wiredtiger/test/suite/test_tiered14.py", line 153, in test_tiered
self.playback(testnum, s)
File "/data/mci/aa39b5e7b622b64e7c11ecf5e98c35d6/wiredtiger/test/suite/test_tiered14.py", line 99, in playback
ds.populate()
File "/data/mci/aa39b5e7b622b64e7c11ecf5e98c35d6/wiredtiger/test/suite/wtdataset.py", line 112, in populate
self.create()
File "/data/mci/aa39b5e7b622b64e7c11ecf5e98c35d6/wiredtiger/test/suite/wtdataset.py", line 65, in create
self.testcase.session.create(self.uri, 'key_format=' + self.key_format
_wiredtiger.WiredTigerError: Resource temporarily unavailable
----------------------------------------------------------------------
failure: test_tiered14.test_tiered14.test_tiered(M.string.simple.s3_store) [
Traceback (most recent call last):
File "/data/mci/aa39b5e7b622b64e7c11ecf5e98c35d6/wiredtiger/test/suite/wttest.py", line 550, in tearDown
self.captureerr.check(self)
File "/data/mci/aa39b5e7b622b64e7c11ecf5e98c35d6/wiredtiger/test/suite/../py_utility/abstract_test_case.py", line 111, in check
testcase.fail('unexpected ' + self.desc + ', contains: "' +
File "/opt/mongodbtoolchain/revisions/5c38b5f1f5fd9eb734d4d8da79892ff2b4e2e5af/stow/python3-v4.518/lib/python3.10/unittest/case.py", line 675, in fail
raise self.failureException(msg)
AssertionError: unexpected error output, contains: "[1739940600:336394][13502:0xffffba4b3690], test_tiered14.test_tiered14.test_tiered(M.string.simple.s3_store), connection: [WT_VERB_EXTENSION][ERROR]: S3ObjectList: ListObjects request to S3 failed.
"
]
Ran 167 tests in 273.689s
s3-tiered-storage-extensions-test task_log
Logs:
[1739940600:336394][13502:0xffffba4b3690], test_tiered14.test_tiered14.test_tiered(M.string.simple.s3_store), connection: [WT_VERB_EXTENSION][ERROR]: S3ObjectList: ListObjects request to S3 failed.