ExportXMLWordPrintableJSON

    • Type: Build Failure
    • Resolution: Unresolved
    • Priority: Major - P3
    • None
    • Affects Version/s: None
    • Component/s: None

      csuite-schema-disagg-abort-stress on ubuntu2004-stress-tests

      Host: i-0d1261832ba5c2e43
      Project: wiredtiger
      Commit: 4e005a43
      Please refer to BF(G) Playbook for instructions on handling BF and BFG tickets as well as Auto-Resolution Rules

      Task Logs:

      csuite-schema-disagg-abort-stress task_log

      Logs:

      [444/680] Building C object test/csuite/CMakeFiles/test_wt16990_disagg_checkpoint_panic.dir/wt16990_disagg_checkpoint_panic/main.c.o
      [449/680] Linking CXX executable test/csuite/wt16990_disagg_checkpoint_panic/test_wt16990_disagg_checkpoint_panic
      

      logs

      csuite-schema-disagg-abort-stress task_log

      Logs:

      [1783917152:801080][47636:0x7f1dd0ff4700], WT_SESSION.commit_transaction: [WT_VERB_DEFAULT][ERROR]: __txn_check_if_stable_has_moved_ahead_commit_ts, 1494: Rollback the transaction because the stable timestamp has moved ahead of the commit timestamp.: Invalid argument
      

      logs

      csuite-schema-disagg-abort-stress task_log

      Logs:

      test_schema_disagg_abort: FAILED: schema_op_insert_data/149: ctx->session->commit_transaction(ctx->session, commit_cfg): Invalid argument
      

      logs

      csuite-schema-disagg-abort-stress task_log

      Logs:

      test_schema_disagg_abort: process aborting
      WiredTiger Error: __wt_abort, 29: aborting WiredTiger library
      

      logs

      csuite-schema-disagg-abort-stress task_log

      Logs:

      test_schema_disagg_abort: FAILED: Child process 47636 abnormally exited: Invalid argument
      

      logs

      csuite-schema-disagg-abort-stress task_log

      Logs:

      test_schema_disagg_abort: process aborting
      WiredTiger Error: __wt_abort, 29: aborting WiredTiger library
      

      logs

      csuite-schema-disagg-abort-stress task_log

      Logs:

      #0  __GI_raise (sig=sig@entry=6) at ../sysdeps/unix/sysv/linux/raise.c:50
      #0  __GI_raise (sig=sig@entry=6) at ../sysdeps/unix/sysv/linux/raise.c:50
      #1  0x00007f1ddfae6859 in __GI_abort () at abort.c:79
      #2  0x00007f1de00ddac7 in __wt_abort (session=session@entry=0x0) at /data/mci/b01ddf49e72f13d6786501bb9edadc4b/wiredtiger/src/os_common/os_abort.c:32
      #3  0x0000000000406338 in testutil_die (e=e@entry=22, fmt=fmt@entry=0x40c180 "Child process %lu abnormally exited") at /data/mci/b01ddf49e72f13d6786501bb9edadc4b/wiredtiger/test/utility/misc.c:75
      #4  0x00000000004028a1 in sig_handler (sig=<optimized out>) at /data/mci/b01ddf49e72f13d6786501bb9edadc4b/wiredtiger/test/csuite/schema_disagg_abort/main.c:78
      #5  <signal handler called>
      #6  0x00007f1ddfba11b4 in __GI___clock_nanosleep (clock_id=<optimized out>, clock_id@entry=0, flags=flags@entry=0, req=req@entry=0x7ffff22f3330, rem=rem@entry=0x7ffff22f3330) at ../sysdeps/unix/sysv/linux/clock_nanosleep.c:78
      #7  0x00007f1ddfba6ec7 in __GI___nanosleep (requested_time=requested_time@entry=0x7ffff22f3330, remaining=remaining@entry=0x7ffff22f3330) at nanosleep.c:27
      #8  0x00007f1ddfba6dfe in __sleep (seconds=0, seconds@entry=300) at ../sysdeps/posix/sleep.c:55
      #9  0x00000000004027b7 in fork_and_kill_child (cfg=cfg@entry=0x7ffff22f4460, timeout=timeout@entry=300) at /data/mci/b01ddf49e72f13d6786501bb9edadc4b/wiredtiger/test/csuite/schema_disagg_abort/main.c:122
      #10 0x0000000000402da8 in main (argc=<optimized out>, argv=0x7ffff22f5998) at /data/mci/b01ddf49e72f13d6786501bb9edadc4b/wiredtiger/test/csuite/schema_disagg_abort/main.c:245
      #0  0x00007f1ddfb0700b in ?? ()
      #0  __GI_raise (sig=sig@entry=6) at ../sysdeps/unix/sysv/linux/raise.c:50
      #1  0x00007f1ddfae6859 in __GI_abort () at abort.c:79
      #2  0x00007f1de00ddac7 in __wt_abort (session=0x0) at /data/mci/b01ddf49e72f13d6786501bb9edadc4b/wiredtiger/src/os_common/os_abort.c:32
      #3  0x0000000000406338 in ?? ()
      #4  0x0000003000000020 in ?? ()
      #5  0x0000003000000028 in ?? ()
      #6  0x00007f1dd0ff1810 in ?? ()
      #7  0x00007f1dd0ff1740 in ?? ()
      #8  0x00007f1dd0ff1810 in ?? ()
      #9  0x00007f1dd0ff1750 in ?? ()
      #10 0x0000000000410a80 in ?? ()
      #11 0x0000000000000095 in ?? ()
      #12 0x000000000040c968 in ?? ()
      #13 0x00007f1dd0ff08f0 in ?? ()
      #14 0x00007f1dd0ff1810 in ?? ()
      #15 0x0000000000000006 in ?? ()
      #16 0x0000000000000000 in ?? ()
      

      logs

            Assignee:
            [DO NOT USE] Backlog - Storage Engines Team
            Reporter:
            xgen-buildbaron-user
            Votes:
            0 Vote for this issue
            Watchers:
            2 Start watching this issue

              Created:
              Updated: