-
Type:
Build Failure
-
Resolution: Fixed
-
Priority:
Major - P3
-
Affects Version/s: None
-
Component/s: Cache and Eviction, Layered Tables, Reconciliation
-
Storage Engines - Transactions
-
1,195.108
-
SE Transactions - 2026-08-28, SE Transactions - 2026-09-11
-
3
-
2
model-test-long-disagg on amazon2023-arm64
Host: i-0e1ec63cf2fc0b75a
Project: wiredtiger
Commit: 2dc4d9b8
Please refer to BF(G) Playbook for instructions on handling BF and BFG tickets as well as Auto-Resolution Rules
Task Logs:
Logs:
[1786252735:225411][138140:0xffffac5ec040], file:table2.wt_stable, close_ckpt: [WT_VERB_DEFAULT][ERROR]: __wti_rec_row_int, 745: WiredTiger assertion failed: 'vpack->type != (0)'. Proxy cell is selected with original child image, vpack->type=0, ref->page_del=NULL [1786252735:225433][138140:0xffffac5ec040], file:table2.wt_stable, close_ckpt: [WT_VERB_DEFAULT][ERROR]: __wt_abort, 29: aborting WiredTiger library
Logs:
Failed to run the workload in WiredTiger: The workload process was terminated with signal 6
Logs:
[1786252742:123222][139049:0xffffac5ec040], file:table2.wt_stable, close_ckpt: [WT_VERB_DEFAULT][ERROR]: __wti_rec_row_int, 745: WiredTiger assertion failed: 'vpack->type != (0)'. Proxy cell is selected with original child image, vpack->type=0, ref->page_del=NULL [1786252742:123242][139049:0xffffac5ec040], file:table2.wt_stable, close_ckpt: [WT_VERB_DEFAULT][ERROR]: __wt_abort, 29: aborting WiredTiger library
Logs:
Counterexample reduction: Failed to run the workload in WiredTiger: The workload process was terminated with signal 6
Logs:
[1786252745:104005][139525:0xffffac5ec040], file:table2.wt_stable, close_ckpt: [WT_VERB_DEFAULT][ERROR]: __wti_rec_row_int, 745: WiredTiger assertion failed: 'vpack->type != (0)'. Proxy cell is selected with original child image, vpack->type=0, ref->page_del=NULL [1786252745:104025][139525:0xffffac5ec040], file:table2.wt_stable, close_ckpt: [WT_VERB_DEFAULT][ERROR]: __wt_abort, 29: aborting WiredTiger library
Logs:
Counterexample reduction: Failed to run the workload in WiredTiger: The workload process was terminated with signal 6
Logs:
[1786252748:009628][139970:0xffffac5ec040], file:table2.wt_stable, close_ckpt: [WT_VERB_DEFAULT][ERROR]: __wti_rec_row_int, 745: WiredTiger assertion failed: 'vpack->type != (0)'. Proxy cell is selected with original child image, vpack->type=0, ref->page_del=NULL [1786252748:009647][139970:0xffffac5ec040], file:table2.wt_stable, close_ckpt: [WT_VERB_DEFAULT][ERROR]: __wt_abort, 29: aborting WiredTiger library
Logs:
Counterexample reduction: Failed to run the workload in WiredTiger: The workload process was terminated with signal 6
Logs:
[1786252753:604594][140799:0xffffac5ec040], file:table2.wt_stable, close_ckpt: [WT_VERB_DEFAULT][ERROR]: __wti_rec_row_int, 745: WiredTiger assertion failed: 'vpack->type != (0)'. Proxy cell is selected with original child image, vpack->type=0, ref->page_del=NULL [1786252753:604614][140799:0xffffac5ec040], file:table2.wt_stable, close_ckpt: [WT_VERB_DEFAULT][ERROR]: __wt_abort, 29: aborting WiredTiger library
Logs:
Counterexample reduction: Failed to run the workload in WiredTiger: The workload process was terminated with signal 6
- is related to
-
WT-18156 Follower checkpoint pickup breaks snapshot isolation for untimestamped readers
-
- Closed
-
- related to
-
WT-18562 Untimestamped fast truncate over a range mixing already-deleted and live keys permanently orphans the deleted key's history-store entry
-
- Open
-
-
WT-18551 Altering write_timestamp_usage to never bypasses the fast-truncate history-store guard from WT-10013
-
- Closed
-
-
WT-18603 failed: format-stress-test-disagg-switch-data-validation-1 on ubuntu2004-stress-tests [wiredtiger @ 6ebd2cfa]
-
- In Code Review
-