-
Type:
Build Failure
-
Resolution: Duplicate
-
Priority:
Major - P3
-
None
-
Affects Version/s: None
-
Component/s: Cache and Eviction
-
Storage Engines - Transactions
-
562.342
-
None
-
None
-
1
unit-test-zstd on amazon2023-arm64
Host: i-0ee6fb8de4a2d178e
Project: wiredtiger
Commit: 8a33b297
Please refer to BF(G) Playbook for instructions on handling BF and BFG tickets as well as Auto-Resolution Rules
Task Logs:
Logs:
[pid:12313]: FAIL: test_txn27.test_txn27.test_rollback_reason
----------------------------------------------------------------------
[pid:12313]: testtools.testresult.real._StringException: Traceback (most recent call last):
File "/data/mci/bc2c96c1fb057fffdead09db0cb8d0fb/wiredtiger/test/suite/helpers/wttest.py", line 162, in wrapper
return func(self, *args, **kwargs)
File "/data/mci/bc2c96c1fb057fffdead09db0cb8d0fb/wiredtiger/test/suite/helpers/wttest.py", line 311, in _callTestMethod
method()
File "/data/mci/bc2c96c1fb057fffdead09db0cb8d0fb/wiredtiger/test/suite/test_txn27.py", line 90, in test_rollback_reason
self.assert_error_equal(wiredtiger.WT_ROLLBACK, wiredtiger.WT_OLDEST_FOR_EVICTION, "Transaction has the oldest pinned transaction ID")
File "/data/mci/bc2c96c1fb057fffdead09db0cb8d0fb/wiredtiger/test/suite/helpers/error_info_util.py", line 38, in assert_error_equal
self.assertEqual(sub_level_err, sub_level_err_val)
AssertionError: -32016 != -32004
----------------------------------------------------------------------
Ran 14460 tests in 2215.910s
- is duplicated by
-
WT-18575 Fix test_disagg_fast_truncate03 flaky assertion from walk-skip event recounting
-
- Closed
-
- is related to
-
WT-18536 Reclaim a skipped disaggregated subtree once its truncate is globally visible
-
- Closed
-
-
WT-13296 test_txn27.test_rollback_reason fails due to missing exception
-
- Open
-
-
WT-15219 Fix test_txn27 cache stuck dirty failure
-
- Closed
-
- related to
-
WT-18708 test_txn27.py fails with unexpected sub error code
-
- Open
-