-
Type:
Build Failure
-
Resolution: Fixed
-
Priority:
Major - P3
-
Affects Version/s: None
-
Component/s: Test Python
-
Storage Engines - Transactions
-
489.55
-
SE Transactions - 2026-09-11, SE Transactions - 2026-09-25
-
3
-
3
unit-test on amazon2023-arm64-release-nonstandalone
Host: i-0662e97c70d5a7200
Project: wiredtiger
Commit: f681f29c
Please refer to BF(G) Playbook for instructions on handling BF and BFG tickets as well as Auto-Resolution Rules
Task Logs:
unit-test task_log
Logs:
[pid:18881]: FAIL: test_disagg_checkpoint_size08.test_disagg_checkpoint_size08.test_skip_write_wrapup_aggregated_flag
----------------------------------------------------------------------
[pid:18881]: testtools.testresult.real._StringException: Traceback (most recent call last):
File "/data/mci/2cd5ab7ed36e5a7cf17f65672659433c/wiredtiger/test/suite/helpers/wttest.py", line 162, in wrapper
return func(self, *args, **kwargs)
File "/data/mci/2cd5ab7ed36e5a7cf17f65672659433c/wiredtiger/test/suite/helpers/wttest.py", line 311, in _callTestMethod
method()
File "/data/mci/2cd5ab7ed36e5a7cf17f65672659433c/wiredtiger/test/suite/test_disagg_checkpoint_size08.py", line 338, in test_skip_write_wrapup_aggregated_flag
self.assertGreater(self.get_stat(stat_key), 0,
AssertionError: 0 not greater than 0 : rec_free_page_id_due_to_failed_replacement_reconciliation should be > 0 after skip-write wrapup followed by failpoint eviction
----------------------------------------------------------------------
Ran 14492 tests in 3626.119s