ExportXMLWordPrintableJSON

    • Type: Build Failure
    • Resolution: Unresolved
    • Priority: Major - P3
    • None
    • Affects Version/s: None
    • Component/s: None

      unit-test-hook-disagg-leader-publish-bucket01 on ubuntu2004-nonstandalone

      Host: i-05d8f2c06932a7b6b
      Project: wiredtiger
      Commit: ca050f0e
      Please refer to BF(G) Playbook for instructions on handling BF and BFG tickets as well as Auto-Resolution Rules

      Task Logs:

      unit-test-hook-disagg-leader-publish-bucket01 task_log

      Logs:

      [pid:13266]: FAIL: test_prepare21.test_prepare21.test_prepare_rollback(row_integer)
      ----------------------------------------------------------------------
      [pid:13266]: testtools.testresult.real._StringException: Traceback (most recent call last):
        File "/data/mci/2db3f9b46a7ae74579000d3e2a753c0c/wiredtiger/test/suite/helpers/wttest.py", line 162, in wrapper
          return func(self, *args, **kwargs)
        File "/data/mci/2db3f9b46a7ae74579000d3e2a753c0c/wiredtiger/test/suite/helpers/wttest.py", line 292, in _callTestMethod
          method()
        File "/data/mci/2db3f9b46a7ae74579000d3e2a753c0c/wiredtiger/test/suite/test_prepare21.py", line 121, in test_prepare_rollback
          self.check(value_a, uri, nrows, 20)
        File "/data/mci/2db3f9b46a7ae74579000d3e2a753c0c/wiredtiger/test/suite/helpers/rollback_to_stable_util.py", line 189, in check
          self.assertEqual(count, nrows)
      AssertionError: 9 != 10
      ----------------------------------------------------------------------
      Ran 2782 tests in 146.115s
      

      logs

            Assignee:
            Krishen Chovhan
            Reporter:
            xgen-buildbaron-user
            Votes:
            0 Vote for this issue
            Watchers:
            3 Start watching this issue

              Created:
              Updated: