-
Type:
Build Failure
-
Resolution: Unresolved
-
Priority:
Major - P3
-
None
-
Affects Version/s: None
-
Component/s: None
-
Storage Engines - Foundations
-
198.976
-
None
-
None
-
1
Host: i-060b095919bc86059
Project: wiredtiger-mongo-v8.3
Commit: e8a5366f
Please refer to BF(G) Playbook for instructions on handling BF and BFG tickets as well as Auto-Resolution Rules
Task Logs:
unit-test task_log
Logs:
[pid:77776]: FAIL: test_hs14.test_hs14.test_hs14(column)
----------------------------------------------------------------------
[pid:77776]: testtools.testresult.real._StringException: Traceback (most recent call last):
File "/data/mci/f546d8750be34f385baf225289696772/wiredtiger/test/suite/wttest.py", line 161, in wrapper
return func(self, *args, **kwargs)
File "/data/mci/f546d8750be34f385baf225289696772/wiredtiger/test/suite/wttest.py", line 309, in _callTestMethod
method()
File "/data/mci/f546d8750be34f385baf225289696772/wiredtiger/test/suite/test_hs14.py", line 106, in test_hs14
self.assertLess(invisible_hs_latency, (visible_hs_latency * 10),
AssertionError: 1.6007521152496338 not less than 0.9376668930053711 : Reader took an order of magnitude longer for when all history store records were invisible, visible=0.09376668930053711, invisible=1.6007521152496338
----------------------------------------------------------------------
Ran 13525 tests in 2027.447s
- is related to
-
WT-9931 Reader took an order of magnitude longer for when all history store records were invisible
-
- Closed
-