ExportXMLWordPrintableJSON

    • Type: Build Failure
    • Resolution: Duplicate
    • Priority: Major - P3
    • None
    • Affects Version/s: None
    • Component/s: Not Applicable

      make-check-test on macos-14-arm64

      Host: macos-14-arm64-10.mac.devprod.mongodb.com
      Project: wiredtiger-mongo-v8.3
      Commit: 95e642ad
      Please refer to BF(G) Playbook for instructions on handling BF and BFG tickets as well as Auto-Resolution Rules

      Task Logs:

      make-check-test task_log

      Logs:

      /Users/ec2-user/data/mci/9960eeb7a01384c9a2a27e2981b90534/wiredtiger/cmake_build/lang/python/CMakeFiles/wiredtiger_python.dir/wiredtigerPYTHON_wrap.c:6370:21: error: call to undeclared function 'PyInt_AsLong'; ISO C99 and later do not support implicit function declarations [-Wimplicit-function-declaration]
      

      logs

      make-check-test task_log

      Logs:

      /Users/ec2-user/data/mci/9960eeb7a01384c9a2a27e2981b90534/wiredtiger/cmake_build/lang/python/CMakeFiles/wiredtiger_python.dir/wiredtigerPYTHON_wrap.c:6783:9: error: call to undeclared function 'PyString_InternFromString'; ISO C99 and later do not support implicit function declarations [-Wimplicit-function-declaration]
      

      logs

      make-check-test task_log

      Logs:

      /Users/ec2-user/data/mci/9960eeb7a01384c9a2a27e2981b90534/wiredtiger/cmake_build/lang/python/CMakeFiles/wiredtiger_python.dir/wiredtigerPYTHON_wrap.c:10845:17: error: call to undeclared function 'PyInt_FromLong'; ISO C99 and later do not support implicit function declarations [-Wimplicit-function-declaration]
      

      logs

      make-check-test task_log

      Logs:

      /Users/ec2-user/data/mci/9960eeb7a01384c9a2a27e2981b90534/wiredtiger/cmake_build/lang/python/CMakeFiles/wiredtiger_python.dir/wiredtigerPYTHON_wrap.c:10987:21: error: call to undeclared function 'PyString_InternFromString'; ISO C99 and later do not support implicit function declarations [-Wimplicit-function-declaration]
      

      logs

      make-check-test task_log

      Logs:

      /Users/ec2-user/data/mci/9960eeb7a01384c9a2a27e2981b90534/wiredtiger/cmake_build/lang/python/CMakeFiles/wiredtiger_python.dir/wiredtigerPYTHON_wrap.c:11085:21: error: call to undeclared function 'PyString_InternFromString'; ISO C99 and later do not support implicit function declarations [-Wimplicit-function-declaration]
      

      logs

      make-check-test task_log

      Logs:

      /Users/ec2-user/data/mci/9960eeb7a01384c9a2a27e2981b90534/wiredtiger/cmake_build/lang/python/CMakeFiles/wiredtiger_python.dir/wiredtigerPYTHON_wrap.c:11877:17: error: call to undeclared function 'PyInt_FromLong'; ISO C99 and later do not support implicit function declarations [-Wimplicit-function-declaration]
      

      logs

      make-check-test task_log

      Logs:

      /Users/ec2-user/data/mci/9960eeb7a01384c9a2a27e2981b90534/wiredtiger/cmake_build/lang/python/CMakeFiles/wiredtiger_python.dir/wiredtigerPYTHON_wrap.c:15647:9: error: call to undeclared function 'PyInt_FromLong'; ISO C99 and later do not support implicit function declarations [-Wimplicit-function-declaration]
      

      logs

      make-check-test task_log

      Logs:

      /Users/ec2-user/data/mci/9960eeb7a01384c9a2a27e2981b90534/wiredtiger/cmake_build/lang/python/CMakeFiles/wiredtiger_python.dir/wiredtigerPYTHON_wrap.c:15749:21: error: call to undeclared function 'PyInt_AsLong'; ISO C99 and later do not support implicit function declarations [-Wimplicit-function-declaration]
      

      logs

      make-check-test task_log

      Logs:

      /Users/ec2-user/data/mci/9960eeb7a01384c9a2a27e2981b90534/wiredtiger/cmake_build/lang/python/CMakeFiles/wiredtiger_python.dir/wiredtigerPYTHON_wrap.c:15803:9: error: call to undeclared function 'PyInt_FromLong'; ISO C99 and later do not support implicit function declarations [-Wimplicit-function-declaration]
      

      logs

      make-check-test task_log

      Logs:

      /Users/ec2-user/data/mci/9960eeb7a01384c9a2a27e2981b90534/wiredtiger/test/model/src/include/model/kv_transaction_snapshot.h:113:52: error: no member named 'inserter' in namespace 'std'
      

      logs

            Assignee:
            [DO NOT USE] Backlog - Storage Engines Team
            Reporter:
            xgen-buildbaron-user
            Votes:
            0 Vote for this issue
            Watchers:
            2 Start watching this issue

              Created:
              Updated:
              Resolved: