-
Type:
Build Failure
-
Resolution: Unresolved
-
Priority:
Major - P3
-
None
-
Affects Version/s: None
-
Component/s: None
-
Storage Engines - Transactions
-
81.145
-
SE Transactions - 2026-10-23
-
3
-
1
unit-test-zstd-bucket02 on amazon2023-arm64
Host: i-0e2e84afc8338028d
Project: wiredtiger
Commit: 761218da
Please refer to BF(G) Playbook for instructions on handling BF and BFG tickets as well as Auto-Resolution Rules
Task Logs:
unit-test-zstd-bucket02 task_log
Logs:
[pid:12381]: FAIL: test_checkpoint39.test_checkpoint39.test_checkpoint_eviction_snapshot_generation
----------------------------------------------------------------------
[pid:12381]: testtools.testresult.real._StringException: Traceback (most recent call last):
File "/data/mci/fcfa27c947ab1cf4ac261777cc57109e/wiredtiger/test/suite/helpers/wttest.py", line 162, in wrapper
return func(self, *args, **kwargs)
File "/data/mci/fcfa27c947ab1cf4ac261777cc57109e/wiredtiger/test/suite/helpers/wttest.py", line 292, in _callTestMethod
method()
File "/data/mci/fcfa27c947ab1cf4ac261777cc57109e/wiredtiger/test/suite/test_checkpoint39.py", line 109, in test_checkpoint_eviction_snapshot_generation
self.assertGreater(declined, 0,
AssertionError: 0 not greater than 0 : eviction declined no snapshots over 1500 batches, so it is adopting snapshots that do not belong to the running checkpoint
----------------------------------------------------------------------
Ran 3583 tests in 581.303s