-
Type:
Build Failure
-
Resolution: Unresolved
-
Priority:
Minor - P4
-
None
-
Affects Version/s: None
-
Component/s: Compaction
-
Storage Engines - Persistence
-
12.254
-
SE Persistence backlog
-
None
-
1
spinlock-gcc-test on amazon2-arm64
Host: i-0e6ddf2743a866cf5
Project: wiredtiger-mongo-v7.0
Commit: da5bdc36
Please refer to BF(G) Playbook for instructions on handling BF and BFG tickets as well as Auto-Resolution Rules
Task Logs:
spinlock-gcc-test task_log
Logs:
[1789624775:128593][16245:0xffff81602110], t, file:T00003.wt, WT_CURSOR.prev: [WT_VERB_DEFAULT][ERROR]: __wt_modify_reconstruct_from_upd_list, 471: Read-uncommitted readers do not support reconstructing a record with modifies.: WT_ROLLBACK: conflict between concurrent operations [1789624775:224756][16245:0xffff81602110], t, file:T00003.wt, WT_CURSOR.search: [WT_VERB_DEFAULT][ERROR]: __wt_modify_reconstruct_from_upd_list, 471: Read-uncommitted readers do not support reconstructing a record with modifies.: WT_ROLLBACK: conflict between concurrent operations [1789624775:313222][16245:0xffff80e01110], t, file:T00003.wt, WT_CURSOR.search: [WT_VERB_DEFAULT][ERROR]: __wt_modify_reconstruct_from_upd_list, 471: Read-uncommitted readers do not support reconstructing a record with modifies.: WT_ROLLBACK: conflict between concurrent operations [1789624775:320068][16245:0xffff82604110], t, file:T00003.wt, WT_CURSOR.search_near: [WT_VERB_DEFAULT][ERROR]: __wt_modify_reconstruct_from_upd_list, 471: Read-uncommitted readers do not support reconstructing a record with modifies.: WT_ROLLBACK: conflict between concurrent operations [1789624775:502834][16245:0xffff82604110], t, file:T00003.wt, WT_CURSOR.search: [WT_VERB_DEFAULT][ERROR]: __wt_modify_reconstruct_from_upd_list, 471: Read-uncommitted readers do not support reconstructing a record with modifies.: WT_ROLLBACK: conflict between concurrent operations [1789624775:653099][16245:0xffff81e03110], t, file:T00001.wt, WT_CURSOR.next: [WT_VERB_DEFAULT][ERROR]: __wt_modify_reconstruct_from_upd_list, 471: Read-uncommitted readers do not support reconstructing a record with modifies.: WT_ROLLBACK: conflict between concurrent operations [1789624775:871761][16245:0xffff81e03110], t, file:T00003.wt, WT_CURSOR.next: [WT_VERB_DEFAULT][ERROR]: __wt_modify_reconstruct_from_upd_list, 471: Read-uncommitted readers do not support reconstructing a record with modifies.: WT_ROLLBACK: conflict between concurrent operations [1789624776:304514][16245:0xffff81602110], t, file:T00003.wt, WT_CURSOR.next: [WT_VERB_DEFAULT][ERROR]: __wt_modify_reconstruct_from_upd_list, 471: Read-uncommitted readers do not support reconstructing a record with modifies.: WT_ROLLBACK: conflict between concurrent operations [1789624776:563065][16245:0xffff81e03110], t, file:T00003.wt, WT_CURSOR.next: [WT_VERB_DEFAULT][ERROR]: __wt_modify_reconstruct_from_upd_list, 471: Read-uncommitted readers do not support reconstructing a record with modifies.: WT_ROLLBACK: conflict between concurrent operations [1789624776:762170][16245:0xffff81e03110], t, file:T00003.wt, WT_CURSOR.prev: [WT_VERB_DEFAULT][ERROR]: __wt_modify_reconstruct_from_upd_list, 471: Read-uncommitted readers do not support reconstructing a record with modifies.: WT_ROLLBACK: conflict between concurrent operations [1789624776:784957][16245:0xffff82604110], t, file:T00003.wt, WT_CURSOR.search: [WT_VERB_DEFAULT][ERROR]: __wt_modify_reconstruct_from_upd_list, 471: Read-uncommitted readers do not support reconstructing a record with modifies.: WT_ROLLBACK: conflict between concurrent operations [1789624777:7214][16245:0xffff81e03110], t, file:T00003.wt, WT_CURSOR.search: [WT_VERB_DEFAULT][ERROR]: __wt_modify_reconstruct_from_upd_list, 471: Read-uncommitted readers do not support reconstructing a record with modifies.: WT_ROLLBACK: conflict between concurrent operations [1789624777:142243][16245:0xffff82604110], t, file:T00003.wt, WT_CURSOR.prev: [WT_VERB_DEFAULT][ERROR]: __wt_modify_reconstruct_from_upd_list, 471: Read-uncommitted readers do not support reconstructing a record with modifies.: WT_ROLLBACK: conflict between concurrent operations [1789624777:142438][16245:0xffff82604110], t, file:T00003.wt, WT_CURSOR.prev: [WT_VERB_DEFAULT][ERROR]: __wt_modify_reconstruct_from_upd_list, 471: Read-uncommitted readers do not support reconstructing a record with modifies.: WT_ROLLBACK: conflict between concurrent operations [1789624777:277431][16245:0xffff82604110], t, file:T00003.wt, WT_CURSOR.next: [WT_VERB_DEFAULT][ERROR]: __wt_modify_reconstruct_from_upd_list, 471: Read-uncommitted readers do not support reconstructing a record with modifies.: WT_ROLLBACK: conflict between concurrent operations [1789624777:551642][16245:0xffff81602110], t, file:T00003.wt, WT_CURSOR.search: [WT_VERB_DEFAULT][ERROR]: __wt_modify_reconstruct_from_upd_list, 471: Read-uncommitted readers do not support reconstructing a record with modifies.: WT_ROLLBACK: conflict between concurrent operations [1789624777:646926][16245:0xffff81602110], t, file:T00003.wt, WT_CURSOR.prev: [WT_VERB_DEFAULT][ERROR]: __wt_modify_reconstruct_from_upd_list, 471: Read-uncommitted readers do not support reconstructing a record with modifies.: WT_ROLLBACK: conflict between concurrent operations [1789624777:716525][16245:0xffff81602110], t, file:T00003.wt, WT_CURSOR.search: [WT_VERB_DEFAULT][ERROR]: __wt_modify_reconstruct_from_upd_list, 471: Read-uncommitted readers do not support reconstructing a record with modifies.: WT_ROLLBACK: conflict between concurrent operations [1789624777:929103][16245:0xffff81602110], t, file:T00003.wt, WT_CURSOR.next: [WT_VERB_DEFAULT][ERROR]: __wt_modify_reconstruct_from_upd_list, 471: Read-uncommitted readers do not support reconstructing a record with modifies.: WT_ROLLBACK: conflict between concurrent operations [1789624777:930324][16245:0xffff81602110], t, file:T00003.wt, WT_CURSOR.next: [WT_VERB_DEFAULT][ERROR]: __wt_modify_reconstruct_from_upd_list, 471: Read-uncommitted readers do not support reconstructing a record with modifies.: WT_ROLLBACK: conflict between concurrent operations [1789624778:237560][16245:0xffff81602110], t, file:T00003.wt, WT_CURSOR.prev: [WT_VERB_DEFAULT][ERROR]: __wt_modify_reconstruct_from_upd_list, 471: Read-uncommitted readers do not support reconstructing a record with modifies.: WT_ROLLBACK: conflict between concurrent operations [1789624778:770368][16245:0xffff81e03110], t, file:T00003.wt, WT_CURSOR.prev: [WT_VERB_DEFAULT][ERROR]: __wt_modify_reconstruct_from_upd_list, 471: Read-uncommitted readers do not support reconstructing a record with modifies.: WT_ROLLBACK: conflict between concurrent operations [1789624779:207332][16245:0xffff80e01110], t, file:T00003.wt, WT_CURSOR.prev: [WT_VERB_DEFAULT][ERROR]: __wt_modify_reconstruct_from_upd_list, 471: Read-uncommitted readers do not support reconstructing a record with modifies.: WT_ROLLBACK: conflict between concurrent operations [1789624779:270940][16245:0xffff81602110], t, file:T00003.wt, WT_CURSOR.next: [WT_VERB_DEFAULT][ERROR]: __wt_modify_reconstruct_from_upd_list, 471: Read-uncommitted readers do not support reconstructing a record with modifies.: WT_ROLLBACK: conflict between concurrent operations [1789624779:410137][16245:0xffff80e01110], t, file:T00003.wt, WT_CURSOR.search_near: [WT_VERB_DEFAULT][ERROR]: __wt_modify_reconstruct_from_upd_list, 471: Read-uncommitted readers do not support reconstructing a record with modifies.: WT_ROLLBACK: conflict between concurrent operations [1789624779:471553][16245:0xffff82604110], t, file:T00003.wt, WT_CURSOR.search: [WT_VERB_DEFAULT][ERROR]: __wt_modify_reconstruct_from_upd_list, 471: Read-uncommitted readers do not support reconstructing a record with modifies.: WT_ROLLBACK: conflict between concurrent operations [1789624779:483874][16245:0xffff82604110], t, file:T00003.wt, WT_CURSOR.search: [WT_VERB_DEFAULT][ERROR]: __wt_modify_reconstruct_from_upd_list, 471: Read-uncommitted readers do not support reconstructing a record with modifies.: WT_ROLLBACK: conflict between concurrent operations [1789624779:681259][16245:0xffff80e01110], t, file:T00003.wt, WT_CURSOR.next: [WT_VERB_DEFAULT][ERROR]: __wt_modify_reconstruct_from_upd_list, 471: Read-uncommitted readers do not support reconstructing a record with modifies.: WT_ROLLBACK: conflict between concurrent operations [1789624779:994257][16245:0xffff82604110], t, file:T00003.wt, WT_CURSOR.prev: [WT_VERB_DEFAULT][ERROR]: __wt_modify_reconstruct_from_upd_list, 471: Read-uncommitted readers do not support reconstructing a record with modifies.: WT_ROLLBACK: conflict between concurrent operations [1789624780:31021][16245:0xffff81e03110], t, file:T00003.wt, WT_CURSOR.next: [WT_VERB_DEFAULT][ERROR]: __wt_modify_reconstruct_from_upd_list, 471: Read-uncommitted readers do not support reconstructing a record with modifies.: WT_ROLLBACK: conflict between concurrent operations [1789624780:44495][16245:0xffff82604110], t, file:T00003.wt, WT_CURSOR.next: [WT_VERB_DEFAULT][ERROR]: __wt_modify_reconstruct_from_upd_list, 471: Read-uncommitted readers do not support reconstructing a record with modifies.: WT_ROLLBACK: conflict between concurrent operations [1789624780:144655][16245:0xffff80e01110], t, file:T00003.wt, WT_CURSOR.next: [WT_VERB_DEFAULT][ERROR]: __wt_modify_reconstruct_from_upd_list, 471: Read-uncommitted readers do not support reconstructing a record with modifies.: WT_ROLLBACK: conflict between concurrent operations [1789624780:556265][16245:0xffff81602110], t, file:T00003.wt, WT_CURSOR.search_near: [WT_VERB_DEFAULT][ERROR]: __wt_modify_reconstruct_from_upd_list, 471: Read-uncommitted readers do not support reconstructing a record with modifies.: WT_ROLLBACK: conflict between concurrent operations [1789624780:682842][16245:0xffff81e03110], t, file:T00003.wt, WT_CURSOR.search: [WT_VERB_DEFAULT][ERROR]: __wt_modify_reconstruct_from_upd_list, 471: Read-uncommitted readers do not support reconstructing a record with modifies.: WT_ROLLBACK: conflict between concurrent operations [1789624780:824039][16245:0xffff82604110], t, file:T00003.wt, WT_CURSOR.next: [WT_VERB_DEFAULT][ERROR]: __wt_modify_reconstruct_from_upd_list, 471: Read-uncommitted readers do not support reconstructing a record with modifies.: WT_ROLLBACK: conflict between concurrent operations [1789624781:158018][16245:0xffff81602110], t, file:T00003.wt, WT_CURSOR.search: [WT_VERB_DEFAULT][ERROR]: __wt_modify_reconstruct_from_upd_list, 471: Read-uncommit
spinlock-gcc-test task_log
Logs:
t: FAILED: copy_on_file/301: write(wfd, buf, (size_t)n) == n: No space left on device
spinlock-gcc-test task_log
Logs:
t: process aborting WiredTiger Error: __wt_abort, 28: aborting WiredTiger library [1789623984:436472][1036:0xffff819d5010], test_rollback_to_stable22.test_rollback_to_stable22.test_rollback_to_stable, file:rollback_to_stable22_0.wt, txn rollback_to_stable: [WT_VERB_RTS][DEBUG_1]: [UPDATE_ABORT] rollback to stable aborting update with txnid=99032, txnid_not_visible=false, stable_timestamp=(0, 990) < durable_timestamp=(0, 1000): true, prepare_state=WT_PREPARE_INIT [1789623984:436479][1036:0xffff819d5010], test_rollback_to_stable22.test_rollback_to_stable22.test_rollback_to_stable, file:rollback_to_stable22_0.wt, txn rollback_to_stable: [WT_VERB_RTS][DEBUG_1]: [UPDATE_ABORT] rollback to stable aborting update with txnid=99033, txnid_not_visible=false, stable_timestamp=(0, 990) < durable_timestamp=(0, 1000): true, prepare_state=WT_PREPARE_INIT [1789623984:436485][1036:0xffff819d5010], test_rollback_to_stable22.test_rollback_to_stable22.test_rollback_to_stable, file:rollback_to_stable22_0.wt, txn rollback_to_stable: [WT_VERB_RTS][DEBUG_1]: [UPDATE_ABORT] rollback to stable aborting update with txnid=99034, txnid_not_visible=false, stable_timestamp=(0, 990) < durable_timestamp=(0, 1000): true, prepare_state=WT_PREPARE_INIT
spinlock-gcc-test task_log
Logs:
write /data/mci/cd8875a2798ecd42efd3fc4986b3cf9f/wiredtiger.tgz: no space left on device
Repro Artifacts:
- is related to
-
WT-10897 Make WT::compact command more test friendly in the MDB layer
-
- Closed
-