-
Type:
Build Failure
-
Resolution: Unresolved
-
Priority:
Major - P3
-
None
-
Affects Version/s: None
-
Component/s: Test Python
-
Storage Engines - Transactions
-
22.996
-
SE Transactions - 2026-11-06
-
3
-
1
Host: i-061b070684b266cd1
Project: wiredtiger-mongo-v9.0
Commit: dd56e4a7
Please refer to BF(G) Playbook for instructions on handling BF and BFG tickets as well as Auto-Resolution Rules
Task Logs:
unit-test-zstd task_log
Logs:
[pid:18122]: FAIL: test_stat17.test_stat17.test_correction_persists_in_memory
----------------------------------------------------------------------
[pid:18122]: testtools.testresult.real._StringException: Traceback (most recent call last):
File "/data/mci/090177e13333b6bfee7678db44773c73/wiredtiger/test/suite/helpers/wttest.py", line 162, in wrapper
return func(self, *args, **kwargs)
File "/data/mci/090177e13333b6bfee7678db44773c73/wiredtiger/test/suite/helpers/wttest.py", line 310, in _callTestMethod
method()
File "/data/mci/090177e13333b6bfee7678db44773c73/wiredtiger/test/suite/test_stat17.py", line 162, in test_correction_persists_in_memory
self.assertEqual(fast_pages, exact_pages,
AssertionError: 80 != 79 : fast read after tree-walk correction should return 79, got 80
----------------------------------------------------------------------
Ran 13520 tests in 6771.587s
- is related to
-
WT-14366 Fix test_checkpoint25 & test_checkpoint24 not able to perform fast truncate operation
-
- Closed
-