-
Type:
Build Failure
-
Resolution: Unresolved
-
Priority:
Major - P3
-
None
-
Affects Version/s: None
-
Component/s: None
-
Storage Engines - Transactions
-
30.159
-
SE Transactions - 2026-10-23
-
5
-
2
spinlock-gcc-test on ubuntu2004-release
Host: i-09bfd805093909005
Project: wiredtiger
Commit: 87272c51
Please refer to BF(G) Playbook for instructions on handling BF and BFG tickets as well as Auto-Resolution Rules
Task Logs:
spinlock-gcc-test system_log
Logs:
CPU constraint detected (sustained >90% for 5+ minutes)
spinlock-gcc-test task_log
Logs:
[pid:264357]: FAIL: test_layered_victim_cache02.test_layered_victim_cache02.test_stepdown_victim_cache_serves_checkpointed_value(palite.shared)
----------------------------------------------------------------------
[pid:264357]: testtools.testresult.real._StringException: Traceback (most recent call last):
File "/data/mci/159d0086271594b04552130aea34dfd4/wiredtiger/test/suite/helpers/wttest.py", line 162, in wrapper
return func(self, *args, **kwargs)
File "/data/mci/159d0086271594b04552130aea34dfd4/wiredtiger/test/suite/helpers/wttest.py", line 292, in _callTestMethod
method()
File "/data/mci/159d0086271594b04552130aea34dfd4/wiredtiger/test/suite/test_layered_victim_cache02.py", line 142, in test_stepdown_victim_cache_serves_checkpointed_value
self.wait_for_victim_puts(puts_before)
File "/data/mci/159d0086271594b04552130aea34dfd4/wiredtiger/test/suite/test_layered_victim_cache02.py", line 88, in wait_for_victim_puts
self.assertLess(time.time(), deadline,
AssertionError: 1790912019.7593982 not less than 1790912019.7580767 : eviction did not put a page in the victim cache after step-down
----------------------------------------------------------------------
Ran 14361 tests in 2439.613s
Repro Artifacts: