-
Type:
Build Failure
-
Resolution: Unresolved
-
Priority:
Major - P3
-
None
-
Affects Version/s: None
-
Component/s: None
unit-test-extra-long on amazon2023-arm64-release-nonstandalone
Host: i-092a69c8a62c45331
Project: wiredtiger
Commit: 87272c51
Please refer to BF(G) Playbook for instructions on handling BF and BFG tickets as well as Auto-Resolution Rules
Task Logs:
unit-test-extra-long task_log
Logs:
[pid:23462]: FAIL: test_layered_delta12.test_layered_delta12.test_delta_insert_keys_at_end_of_base_image(palite.write_internal_only)
----------------------------------------------------------------------
[pid:23462]: testtools.testresult.real._StringException: Traceback (most recent call last):
File "/data/mci/39ea7080cd14db80bf1242de3543b7fd/wiredtiger/test/suite/helpers/wttest.py", line 162, in wrapper
return func(self, *args, **kwargs)
File "/data/mci/39ea7080cd14db80bf1242de3543b7fd/wiredtiger/test/suite/helpers/wttest.py", line 292, in _callTestMethod
method()
File "/data/mci/39ea7080cd14db80bf1242de3543b7fd/wiredtiger/test/suite/test_layered_delta12.py", line 255, in test_delta_insert_keys_at_end_of_base_image
self.assertStatGreaterSoon(stat.conn.cache_read_internal_delta, 0)
File "/data/mci/39ea7080cd14db80bf1242de3543b7fd/wiredtiger/test/suite/helpers/wttest.py", line 1003, in assertStatGreaterSoon
self.assertGreater(val, threshold, msg)
AssertionError: 0 not greater than 0
----------------------------------------------------------------------
Ran 43503 tests in 5199.301s
- is related to
-
WT-18806 test_layered_delta15 flakes on cache_read_internal_delta == 0 (write_both scenario)
-
- Closed
-