ExportXMLWordPrintableJSON

    • Type: Build Failure
    • Resolution: Unresolved
    • Priority: Major - P3
    • None
    • Affects Version/s: None
    • Component/s: None
    • None

      unit-test-bucket06 failed on ! Ubuntu 20.04 (Non-standalone)

      Host: N/A
      Project: WiredTiger (develop)
      Commit: diff: 'wiredtiger/wiredtiger' pull request #14862 by etienneptl: WT-17991 Update WT_STAT_MSECS_HIST_INCR_FUNC to fill 2ms and 5ms buckets (https://github.com/wiredtiger/wiredtiger/pull/14862) | 03 Oct 26 00:19 UTC
      Evergreen Subscription: ; Evergreen Event:

      Task Logs (unit-test-bucket06)

      ======================================================================
      [pid:22994]: FAIL: test_layered_delta12.test_layered_delta12.test_base_image_has_more_keys_at_end_of_merge(palite.write_both)
      ----------------------------------------------------------------------
      [pid:22994]: testtools.testresult.real._StringException: Traceback (most recent call last):
        File "wiredtiger/test/suite/helpers/wttest.py", line 162, in wrapper
          return func(self, *args, **kwargs)
        File "wiredtiger/test/suite/helpers/wttest.py", line 292, in _callTestMethod
          method()
        File "wiredtiger/test/suite/test_layered_delta12.py", line 321, in test_base_image_has_more_keys_at_end_of_merge
          self.assertStatGreaterSoon(stat.conn.rec_page_delta_internal, 0)
        File "wiredtiger/test/suite/helpers/wttest.py", line 1003, in assertStatGreaterSoon
          self.assertGreater(val, threshold, msg)
      AssertionError: 0 not greater than 0
      ----------------------------------------------------------------------
      

            Assignee:
            [DO NOT USE] Backlog - Storage Engines Team
            Reporter:
            Xgen-Evergreen-User
            Votes:
            0 Vote for this issue
            Watchers:
            1 Start watching this issue

              Created:
              Updated: