ExportXMLWordPrintableJSON

    • Type: Build Failure
    • Resolution: Unresolved
    • Priority: Major - P3
    • None
    • Affects Version/s: None
    • Component/s: None

      model-test-long on ubuntu2004

      Host: i-066c837b834f2a8f2
      Project: wiredtiger-mongo-v8.0
      Commit: c93d0776
      Please refer to BF(G) Playbook for instructions on handling BF and BFG tickets as well as Auto-Resolution Rules

      Task Logs:

      model-test-long task_log

      Logs:

      /opt/mongodbtoolchain/revisions/93d85cc1a00ca1d53fcc7d4ca790f19a4e5dd542/scripts/products.sh: line 13: /opt/mongodbtoolchain/revisions/93d85cc1a00ca1d53fcc7d4ca790f19a4e5dd542/scripts/installer.sh: No such file or directory
      

      logs

      model-test-long task_log

      Logs:

      [1790952403:687422][141759:0x7fce73d24740], WT_SESSION.prepare_transaction: [WT_VERB_DEFAULT][ERROR]: __wt_txn_prepare, 2100: WiredTiger assertion failed: '!((((txn)->flags) & (0x000002u)) != 0)'. Expression returned false
      [1790952403:687446][141759:0x7fce73d24740], WT_SESSION.prepare_transaction: [WT_VERB_DEFAULT][ERROR]: __wt_abort, 28: aborting WiredTiger library
      

      logs

      model-test-long task_log

      Logs:

      Failed to run the workload in WiredTiger: The workload process was terminated with signal 6
      

      logs

      model-test-long task_log

      Logs:

      [1790952408:128756][141776:0x7fce73d24740], WT_SESSION.prepare_transaction: [WT_VERB_DEFAULT][ERROR]: __wt_txn_prepare, 2100: WiredTiger assertion failed: '!((((txn)->flags) & (0x000002u)) != 0)'. Expression returned false
      [1790952408:128780][141776:0x7fce73d24740], WT_SESSION.prepare_transaction: [WT_VERB_DEFAULT][ERROR]: __wt_abort, 28: aborting WiredTiger library
      

      logs

      model-test-long task_log

      Logs:

      Counterexample reduction: Failed to run the workload in WiredTiger: The workload process was terminated with signal 6
      

      logs

      model-test-long task_log

      Logs:

      [1790952409:909578][141878:0x7fce73d24740], WT_SESSION.prepare_transaction: [WT_VERB_DEFAULT][ERROR]: __wt_txn_prepare, 2100: WiredTiger assertion failed: '!((((txn)->flags) & (0x000002u)) != 0)'. Expression returned false
      [1790952409:909602][141878:0x7fce73d24740], WT_SESSION.prepare_transaction: [WT_VERB_DEFAULT][ERROR]: __wt_abort, 28: aborting WiredTiger library
      

      logs

      model-test-long task_log

      Logs:

      Counterexample reduction: Failed to run the workload in WiredTiger: The workload process was terminated with signal 6
      

      logs

      model-test-long task_log

      Logs:

      [1790952410:739593][141895:0x7fce73d24740], WT_SESSION.prepare_transaction: [WT_VERB_DEFAULT][ERROR]: __wt_txn_prepare, 2100: WiredTiger assertion failed: '!((((txn)->flags) & (0x000002u)) != 0)'. Expression returned false
      [1790952410:739616][141895:0x7fce73d24740], WT_SESSION.prepare_transaction: [WT_VERB_DEFAULT][ERROR]: __wt_abort, 28: aborting WiredTiger library
      

      logs

      model-test-long task_log

      Logs:

      Counterexample reduction: Failed to run the workload in WiredTiger: The workload process was terminated with signal 6
      

      logs

      model-test-long task_log

      Logs:

      [1790952412:112856][141990:0x7fce73d24740], WT_SESSION.prepare_transaction: [WT_VERB_DEFAULT][ERROR]: __wt_txn_prepare, 2100: WiredTiger assertion failed: '!((((txn)->flags) & (0x000002u)) != 0)'. Expression returned false
      [1790952412:112881][141990:0x7fce73d24740], WT_SESSION.prepare_transaction: [WT_VERB_DEFAULT][ERROR]: __wt_abort, 28: aborting WiredTiger library
      

      logs

            Assignee:
            [DO NOT USE] Backlog - Storage Engines Team
            Reporter:
            xgen-buildbaron-user
            Votes:
            0 Vote for this issue
            Watchers:
            1 Start watching this issue

              Created:
              Updated: