-
Type:
Build Failure
-
Resolution: Unresolved
-
Priority:
Major - P3
-
None
-
Affects Version/s: None
-
Component/s: None
-
Storage Engines - Transactions
-
309.15
-
SE Transactions - 2027-01-01
-
None
-
1
unit-test on amazon2023-arm64-nonstandalone
Host: i-0e80a1f99f4d33045
Project: wiredtiger
Commit: 81fc9ba1
Please refer to BF(G) Playbook for instructions on handling BF and BFG tickets as well as Auto-Resolution Rules
Task Logs:
unit-test task_log
Logs:
[pid:12404]: FAIL: test_layered_evict_restore01.test_layered_evict_restore01.test_restore_loop_skips_restored_pages(palite)
----------------------------------------------------------------------
[pid:12404]: testtools.testresult.real._StringException: Traceback (most recent call last):
File "/data/mci/f80469d3da257faba475b8b466774ba1/wiredtiger/test/suite/helpers/wttest.py", line 162, in wrapper
return func(self, *args, **kwargs)
File "/data/mci/f80469d3da257faba475b8b466774ba1/wiredtiger/test/suite/helpers/wttest.py", line 292, in _callTestMethod
method()
File "/data/mci/f80469d3da257faba475b8b466774ba1/wiredtiger/test/suite/test_layered_evict_restore01.py", line 133, in test_restore_loop_skips_restored_pages
self.assertGreater(skips, 0,
AssertionError: 0 not greater than 0 : restored pages re-queued: 0 restores in 5s idle, 0 skips
----------------------------------------------------------------------
Ran 14390 tests in 3529.021s