ExportXMLWordPrintableJSON

    • Type: Build Failure
    • Resolution: Unresolved
    • Priority: Major - P3
    • None
    • Affects Version/s: None
    • Component/s: None

      unit-test-extra-long on ubuntu2004-nonstandalone

      Host: i-0234b83263c61f7b3
      Project: wiredtiger
      Commit: deee5a96
      Please refer to BF(G) Playbook for instructions on handling BF and BFG tickets as well as Auto-Resolution Rules

      Task Logs:

      unit-test-extra-long task_log

      Logs:

      [pid:14760]: FAIL: test_layered_stepup11.test_layered_stepup11.test_layered_stepup11
      ----------------------------------------------------------------------
      [pid:14760]: testtools.testresult.real._StringException: Traceback (most recent call last):
        File "/data/mci/48616cc02386e6c433b04152d941d364/wiredtiger/test/suite/helpers/wttest.py", line 162, in wrapper
          return func(self, *args, **kwargs)
        File "/data/mci/48616cc02386e6c433b04152d941d364/wiredtiger/test/suite/helpers/wttest.py", line 292, in _callTestMethod
          method()
        File "/data/mci/48616cc02386e6c433b04152d941d364/wiredtiger/test/suite/test_layered_stepup11.py", line 141, in test_layered_stepup11
          self.assertEqual(miss, 0)
      AssertionError: 16 != 0
      ----------------------------------------------------------------------
      Ran 43552 tests in 4654.589s
      

      logs

            Assignee:
            [DO NOT USE] Backlog - Storage Engines Team
            Reporter:
            xgen-buildbaron-user
            Votes:
            0 Vote for this issue
            Watchers:
            1 Start watching this issue

              Created:
              Updated: