-
Type:
Build Failure
-
Resolution: Unresolved
-
Priority:
Major - P3
-
None
-
Affects Version/s: None
-
Component/s: Block Cache
-
Storage Engines - Persistence, Storage Engines - Server Integration
-
146.316
-
StorEng - Defined Pipeline
-
None
-
1
Host: i-0293fa510f113c5c2
Project: wiredtiger
Commit: a248c487
Please refer to BF(G) Playbook for instructions on handling BF and BFG tickets as well as Auto-Resolution Rules
Task Logs:
unit-test task_log
Logs:
[pid:36873]: FAIL: test_layered_victim_cache02.test_layered_victim_cache02.test_stepdown_victim_cache_serves_checkpointed_value(palite.shared)
----------------------------------------------------------------------
[pid:36873]: testtools.testresult.real._StringException: Traceback (most recent call last):
File "/data/mci/a00337a75a91029436e71b9720561a48/wiredtiger/test/suite/helpers/wttest.py", line 162, in wrapper
return func(self, *args, **kwargs)
File "/data/mci/a00337a75a91029436e71b9720561a48/wiredtiger/test/suite/helpers/wttest.py", line 292, in _callTestMethod
method()
File "/data/mci/a00337a75a91029436e71b9720561a48/wiredtiger/test/suite/test_layered_victim_cache02.py", line 142, in test_stepdown_victim_cache_serves_checkpointed_value
self.wait_for_victim_puts(puts_before)
File "/data/mci/a00337a75a91029436e71b9720561a48/wiredtiger/test/suite/test_layered_victim_cache02.py", line 88, in wait_for_victim_puts
self.assertLess(time.time(), deadline,
AssertionError: 1792026301.3191361 not less than 1792026301.3133643 : eviction did not put a page in the victim cache after step-down
----------------------------------------------------------------------
Ran 14497 tests in 2212.418s
- related to
-
WT-18885 Victim cache serves empty skip-write images, tripping the empty-page assertion in __random_leaf_disk
-
- Closed
-