Uploaded image for project: 'WiredTiger'
  1. WiredTiger
  2. WT-6057

Failed: unit-test-bucket09 on Ubuntu 18.04 (Python3) [WiredTiger (develop) @ 1e30c67d] test_txn06

    XMLWordPrintable

    Details

    • Type: Build Failure
    • Status: Closed
    • Priority: Major - P3
    • Resolution: Gone away
    • Affects Version/s: None
    • Fix Version/s: None
    • Component/s: None
    • Labels:
      None
    • Story Points:
      8

      Description

      unit-test-bucket09 failed on Ubuntu 18.04 (Python3)

      Host: ec2-54-236-54-175.compute-1.amazonaws.com
      Project: WiredTiger (develop)
      Commit: diff: WT-5544 Cache stuck during salvage #5548

      Don't restore the page memory footprint, eviction itself can take long enough that the cache stuck algorithms fire. | 23 Apr 20 15:36 UTC
      Evergreen Subscription: ; Evergreen Event:

      Task Logs

      Failure is test_txn06:

      [2020/04/23 15:52:18.733] FAIL: test_txn06.test_txn06.test_long_running (subunit.RemotedTestCase)
      [2020/04/23 15:52:18.733] test_txn06.test_txn06.test_long_running
      [2020/04/23 15:52:18.733] ----------------------------------------------------------------------
      [2020/04/23 15:52:18.733] testtools.testresult.real._StringException: Traceback (most recent call last):
      [2020/04/23 15:52:18.733]   File "/data/mci/fe6159833bfa8b090a0b58fe11d7de14/wiredtiger/test/suite/wttest.py", line 446, in tearDown
      [2020/04/23 15:52:18.733]     self.captureout.check(self)
      [2020/04/23 15:52:18.733]   File "/data/mci/fe6159833bfa8b090a0b58fe11d7de14/wiredtiger/test/suite/wttest.py", line 109, in check
      [2020/04/23 15:52:18.733]     contents + '"')
      [2020/04/23 15:52:18.733]   File "/opt/mongodbtoolchain/revisions/23805b43dd027076b4ae48533ab385e20c61e0cf/stow/python3-v3.kzc/lib/python3.7/unittest/case.py", line 680, in fail
      [2020/04/23 15:52:18.733]     raise self.failureException(msg)
      [2020/04/23 15:52:18.733] AssertionError: unexpected standard output, contains: "[1587657081:142060][10773:0x7fea5066f700], test_txn06.test_txn06.test_long_running, eviction-server: old snapshot 100008 pinned in session 12 [WT_CURSOR.get_value] with snap_min 100008
      [2020/04/23 15:52:18.733] "
      

        Attachments

          Issue Links

            Activity

              People

              Assignee:
              backlog-server-storage-engines Backlog - Storage Engines Team
              Reporter:
              xgen-evg-user Xgen-Evergreen-User
              Votes:
              0 Vote for this issue
              Watchers:
              2 Start watching this issue

                Dates

                Created:
                Updated:
                Resolved: