Uploaded image for project: 'WiredTiger'
  1. WiredTiger
  2. WT-7008

Failed: unit-test on OS X 10.12 [WiredTiger (develop) @ 54a88491], test_compact02

    XMLWordPrintable

    Details

    • Type: Build Failure
    • Status: Open
    • Priority: Major - P3
    • Resolution: Unresolved
    • Affects Version/s: None
    • Fix Version/s: Backlog
    • Component/s: None
    • Labels:
      None

      Description

      unit-test failed on OS X 10.12

      Host: macos-1012-88.macstadium.build.10gen.cc
      Project: WiredTiger (develop)
      Commit: diff: WT-6983 Make wiredtiger.in text wrapping consistent across Python versions (#6168) | 08 Dec 20 03:11 UTC
      Evergreen Subscription: ; Evergreen Event:

      Task Logs

      Signature:

      [2020/12/08 05:27:27.661] ======================================================================
      [2020/12/08 05:27:27.661] FAIL: test_compact02.test_compact02.test_compact02(table.1mb.64KB) (subunit.RemotedTestCase)
      [2020/12/08 05:27:27.661] test_compact02.test_compact02.test_compact02(table.1mb.64KB)
      [2020/12/08 05:27:27.661] ----------------------------------------------------------------------
      [2020/12/08 05:27:27.661] testtools.testresult.real._StringException: Traceback (most recent call last):
      [2020/12/08 05:27:27.661]   File "/data/mci/fb8c1fb0066449ba60f8af973932f9af/wiredtiger/test/suite/wttest.py", line 457, in tearDown
      [2020/12/08 05:27:27.661]     self.captureerr.check(self)
      [2020/12/08 05:27:27.661]   File "/data/mci/fb8c1fb0066449ba60f8af973932f9af/wiredtiger/test/suite/wttest.py", line 113, in check
      [2020/12/08 05:27:27.661]     contents + '"')
      [2020/12/08 05:27:27.661]   File "/opt/mongodbtoolchain/stow/osx-python3-v3.kRB/lib/python3.7/unittest/case.py", line 680, in fail
      [2020/12/08 05:27:27.661]     raise self.failureException(msg)
      [2020/12/08 05:27:27.661] AssertionError: unexpected error output, contains: "[1607397836:284755][62379:0x7fff974ff3c0], test_compact02.test_compact02.test_compact02(table.1mb.64KB), WT_SESSION.compact: __compact_worker, 298: compaction halted by eviction pressure: Resource busy
      [2020/12/08 05:27:27.661] "
      [2020/12/08 05:27:27.661] ---------------------------------------------------------------------- 

        Attachments

          Activity

            People

            Assignee:
            backlog-server-storage-engines Backlog - Storage Engines Team
            Reporter:
            xgen-evg-user Xgen-Evergreen-User
            Votes:
            0 Vote for this issue
            Watchers:
            1 Start watching this issue

              Dates

              Created:
              Updated: