Uploaded image for project: 'WiredTiger'
  1. WiredTiger
  2. WT-8268

Failed: test_compact03 with connection timeout on ~ Ubuntu 18.04 PPC [WiredTiger (develop) @ 598db0a6]

    XMLWordPrintable

    Details

    • Type: Build Failure
    • Status: Open
    • Priority: Major - P3
    • Resolution: Unresolved
    • Affects Version/s: None
    • Fix Version/s: Backlog
    • Component/s: None
    • Labels:
    • Story Points:
      5
    • Sprint:
      Storage - Ra 2022-01-10

      Description

      Signature:

      [2021/10/22 06:19:18.426] ======================================================================
      [2021/10/22 06:19:18.426] ERROR: test_compact03.test_compact03.test_compact03(1KB.truncate) (subunit.RemotedTestCase)
      [2021/10/22 06:19:18.426] test_compact03.test_compact03.test_compact03(1KB.truncate)
      [2021/10/22 06:19:18.426] ----------------------------------------------------------------------
      [2021/10/22 06:19:18.426] testtools.testresult.real._StringException: Traceback (most recent call last):
      [2021/10/22 06:19:18.426]   File "/data/mci/acc37694d7ef60fe67ea25e22f909efe/wiredtiger/test/suite/test_compact03.py", line 157, in test_compact03
      [2021/10/22 06:19:18.426]     self.session.compact(self.uri)
      [2021/10/22 06:19:18.426] _wiredtiger.WiredTigerError: Connection timed out
      [2021/10/22 06:19:18.426] ======================================================================
      [2021/10/22 06:19:18.426] ERROR: test_compact03.test_compact03.test_compact03(4KB.truncate) (subunit.RemotedTestCase)
      [2021/10/22 06:19:18.426] test_compact03.test_compact03.test_compact03(4KB.truncate)
      [2021/10/22 06:19:18.426] ----------------------------------------------------------------------
      [2021/10/22 06:19:18.426] testtools.testresult.real._StringException: Traceback (most recent call last):
      [2021/10/22 06:19:18.426]   File "/data/mci/acc37694d7ef60fe67ea25e22f909efe/wiredtiger/test/suite/test_compact03.py", line 157, in test_compact03
      [2021/10/22 06:19:18.426]     self.session.compact(self.uri)
      [2021/10/22 06:19:18.426] _wiredtiger.WiredTigerError: Connection timed out
      [2021/10/22 06:19:18.426] ======================================================================
      [2021/10/22 06:19:18.426] ERROR: test_compact03.test_compact03.test_compact03(1KB.no_truncate) (subunit.RemotedTestCase)
      [2021/10/22 06:19:18.426] test_compact03.test_compact03.test_compact03(1KB.no_truncate)
      [2021/10/22 06:19:18.426] ----------------------------------------------------------------------
      [2021/10/22 06:19:18.426] testtools.testresult.real._StringException: Traceback (most recent call last):
      [2021/10/22 06:19:18.426]   File "/data/mci/acc37694d7ef60fe67ea25e22f909efe/wiredtiger/test/suite/test_compact03.py", line 157, in test_compact03
      [2021/10/22 06:19:18.426]     self.session.compact(self.uri)
      [2021/10/22 06:19:18.426] _wiredtiger.WiredTigerError: Connection timed out
      [2021/10/22 06:19:18.426] ======================================================================
      [2021/10/22 06:19:18.426] ERROR: test_compact03.test_compact03.test_compact03(4KB.no_truncate) (subunit.RemotedTestCase)
      [2021/10/22 06:19:18.426] test_compact03.test_compact03.test_compact03(4KB.no_truncate)
      [2021/10/22 06:19:18.426] ----------------------------------------------------------------------
      [2021/10/22 06:19:18.426] testtools.testresult.real._StringException: Traceback (most recent call last):
      [2021/10/22 06:19:18.426]   File "/data/mci/acc37694d7ef60fe67ea25e22f909efe/wiredtiger/test/suite/test_compact03.py", line 157, in test_compact03
      [2021/10/22 06:19:18.426]     self.session.compact(self.uri)
      [2021/10/22 06:19:18.427] _wiredtiger.WiredTigerError: Connection timed out
      [2021/10/22 06:19:18.427] ----------------------------------------------------------------------
      

      unit-test failed on ~ Ubuntu 18.04 PPC

      Host: ubuntu1804-ppc-6.pic.build.10gen.cc
      Project: WiredTiger (develop)
      Commit: diff: WT-8151 Make durable_start_ts equal to stop_ts if stop_ts is less than durable_start_ts and greater than start_ts (#7086) | 22 Oct 21 00:55 UTC
      Evergreen Subscription: ; Evergreen Event:

      Task Logs (unit-test)

        Attachments

          Issue Links

            Activity

              People

              Assignee:
              backlog-server-storage-engines Backlog - Storage Engines Team
              Reporter:
              xgen-evg-user Xgen-Evergreen-User
              Votes:
              0 Vote for this issue
              Watchers:
              3 Start watching this issue

                Dates

                Created:
                Updated: