Uploaded image for project: 'WiredTiger'
  1. WiredTiger
  2. WT-9152

failed: spinlock-pthread-adaptive-test on rhel80 [wiredtiger @ 1e26b59b]

    • Type: Icon: Build Failure Build Failure
    • Resolution: Duplicate
    • Priority: Icon: Major - P3 Major - P3
    • None
    • Affects Version/s: None
    • Component/s: None
    • Labels:

      spinlock-pthread-adaptive-test on rhel80

      Host: i-017dbffa28382c470
      Project: wiredtiger
      Commit: 1e26b59b

      Task Logs:

      spinlock-pthread-adaptive-test task_log

      Logs:

      C Suite Failure Assertion message
      102/103 Test #104: cppsuite .........................................***Exception: Child aborted 68.99 sec
      Link: https://evergreen.mongodb.com/task_log_raw/wiredtiger_rhel80_spinlock_pthread_adaptive_test_1e26b59bc55bc111d7b623685731e0784a52d281_22_04_14_08_43_01/0?type=T#L1374
      
      C/CPP Suite Failure message
      run: FAILED: runtime_monitor: Cache usage exceeded during test! Limit: 100 usage: 102.749918: error return: -1
      Link: https://evergreen.mongodb.com/task_log_raw/wiredtiger_rhel80_spinlock_pthread_adaptive_test_1e26b59bc55bc111d7b623685731e0784a52d281_22_04_14_08_43_01/0?type=T#L1375
      
      Failure keywords
      run: process aborting
      Link: https://evergreen.mongodb.com/task_log_raw/wiredtiger_rhel80_spinlock_pthread_adaptive_test_1e26b59bc55bc111d7b623685731e0784a52d281_22_04_14_08_43_01/0?type=T#L1376
      
      Failure keywords
      WiredTiger Error: __wt_abort, 28: aborting WiredTiger library
      Link: https://evergreen.mongodb.com/task_log_raw/wiredtiger_rhel80_spinlock_pthread_adaptive_test_1e26b59bc55bc111d7b623685731e0784a52d281_22_04_14_08_43_01/0?type=T#L1377
      
      C/CPP Suite Failure message
      The following tests FAILED:
      Link: https://evergreen.mongodb.com/task_log_raw/wiredtiger_rhel80_spinlock_pthread_adaptive_test_1e26b59bc55bc111d7b623685731e0784a52d281_22_04_14_08_43_01/0?type=T#L1389
      

      logs

            Assignee:
            backlog-server-storage-engines Backlog - Storage Engines Team
            Reporter:
            Xgen-BuildBaron-User xgen-buildbaron-user
            Votes:
            0 Vote for this issue
            Watchers:
            1 Start watching this issue

              Created:
              Updated:
              Resolved:

                Error rendering 'slack.nextup.jira:slack-integration-plus'. Please contact your Jira administrators.