Uploaded image for project: 'WiredTiger'
  1. WiredTiger
  2. WT-9193

test_gc02 WT_ROLLBACK: conflict between concurrent operations

    • Type: Icon: Build Failure Build Failure
    • Resolution: Duplicate
    • Priority: Icon: Major - P3 Major - P3
    • None
    • Affects Version/s: None
    • Component/s: None

      unit-test on macos-1014

      Host: macos-1014-142.macstadium.build.10gen.cc
      Project: wiredtiger
      Commit: d20a5bcc

      Task Logs:

      unit-test task_log

      Logs:

      Test failure
      [2022/04/21 09:01:38.759] ======================================================================
       [2022/04/21 09:01:38.759] ERROR: test_gc02.test_gc02.test_gc (subunit.RemotedTestCase)
       [2022/04/21 09:01:38.759] test_gc02.test_gc02.test_gc
       [2022/04/21 09:01:38.759] ----------------------------------------------------------------------
       [2022/04/21 09:01:38.759] testtools.testresult.real._StringException: Traceback (most recent call last):
       [2022/04/21 09:01:38.759]   File "/data/mci/7e2745c3ae6b34186696a25e92243934/wiredtiger/test/suite/test_gc02.py", line 92, in test_gc
       [2022/04/21 09:01:38.759]     self.large_updates(uri, bigvalue, ds, nrows, 200)
       [2022/04/21 09:01:38.759]   File "/data/mci/7e2745c3ae6b34186696a25e92243934/wiredtiger/test/suite/test_gc01.py", line 47, in large_updates
       [2022/04/21 09:01:38.759]     cursor[ds.key(i)] = value
       [2022/04/21 09:01:38.759]   File "/data/mci/7e2745c3ae6b34186696a25e92243934/wiredtiger/cmake_build/lang/python/wiredtiger/swig_wiredtiger.py", line 349, in __setitem__
       [2022/04/21 09:01:38.759]     if self.insert() != 0:
       [2022/04/21 09:01:38.759] _wiredtiger.WiredTigerError: WT_ROLLBACK: conflict between concurrent operations
       [2022/04/21 09:01:38.759] ----------------------------------------------------------------------
      Link: https://evergreen.mongodb.com/task_log_raw/wiredtiger_macos_1014_unit_test_d20a5bcc72c33638ab70016459f3f9244246612d_22_04_21_05_09_15/0?type=T#L32541
      
      Evergreen YAML Script Failure
      Command failed: command encountered problem: error waiting on process 'dfc994a6-04ef-4031-9c70-25aa86470cd2': exit status 1
      Link: https://evergreen.mongodb.com/task_log_raw/wiredtiger_macos_1014_unit_test_d20a5bcc72c33638ab70016459f3f9244246612d_22_04_21_05_09_15/0?type=T#L32557
      

      logs

            Assignee:
            backlog-server-storage-engines Backlog - Storage Engines Team
            Reporter:
            Xgen-BuildBaron-User xgen-buildbaron-user
            Votes:
            0 Vote for this issue
            Watchers:
            5 Start watching this issue

              Created:
              Updated:
              Resolved: