Uploaded image for project: 'WiredTiger'
  1. WiredTiger
  2. WT-9264

failed: test_checkpoint __wt_gen_drain timeout on macos-1014 [wiredtiger @ de7db74e]

    XMLWordPrintable

Details

    • Build Failure
    • Status: Open
    • Major - P3
    • Resolution: Unresolved
    • None
    • None
    • None

    Description

      make-check-test on macos-1014

      Host: macos-1014-5.macstadium.build.10gen.cc
      Project: wiredtiger
      Commit: de7db74e

      Task Logs:

      make-check-test task_log

      Logs:

      C Suite Failure Assertion message
       63/105 Test  #49: test_checkpoint_row_stress_sweep_timestamps ......***Exception: Child aborted209.48 sec
      Link: https://evergreen.mongodb.com/task_log_raw/wiredtiger_macos_1014_make_check_test_de7db74e12cdedd6d026e7674c466d95e47024bd_22_04_29_11_19_21/0?type=T#L1325
       
      Verbose Error message
      [1651236332:410436][16530:0x700000c44000], test_checkpoint, file:__wt0000.wt, WT_SESSION.checkpoint: [WT_VERB_DEFAULT][ERROR]: void __wt_gen_drain(WT_SESSION_IMPL *, int, uint64_t), 173: minutes < WT_GEN_DRAIN_TIMEOUT_MIN
      [1651236332:410457][16530:0x700000c44000], test_checkpoint, file:__wt0000.wt, WT_SESSION.checkpoint: [WT_VERB_DEFAULT][ERROR]: void __wt_abort(WT_SESSION_IMPL *), 28: aborting WiredTiger library
      Link: https://evergreen.mongodb.com/task_log_raw/wiredtiger_macos_1014_make_check_test_de7db74e12cdedd6d026e7674c466d95e47024bd_22_04_29_11_19_21/0?type=T#L1340
       
      C/CPP Suite Failure message
      The following tests FAILED:
       
      Link: https://evergreen.mongodb.com/task_log_raw/wiredtiger_macos_1014_make_check_test_de7db74e12cdedd6d026e7674c466d95e47024bd_22_04_29_11_19_21/0?type=T#L1425
       
      Evergreen YAML Script Failure
      Command failed: command encountered problem: error waiting on process '25f42d31-e463-48c2-b3dd-d029a71aa24c': exit status 8
       
      Link: https://evergreen.mongodb.com/task_log_raw/wiredtiger_macos_1014_make_check_test_de7db74e12cdedd6d026e7674c466d95e47024bd_22_04_29_11_19_21/0?type=T#L1430

      logs

      Attachments

        Activity

          People

            backlog-server-storage-engines Backlog - Storage Engines Team
            Xgen-BuildBaron-User xgen-buildbaron-user
            Votes:
            0 Vote for this issue
            Watchers:
            1 Start watching this issue

            Dates

              Created:
              Updated: