Uploaded image for project: 'WiredTiger'
  1. WiredTiger
  2. WT-9265

failed: test_compact02 unexpected std output on macos-1014 [wiredtiger @ f7f24e33]

    XMLWordPrintable

Details

    • Build Failure
    • Status: Open
    • Major - P3
    • Resolution: Unresolved
    • None
    • None
    • None
    • StorEng - Refinement Pipeline

    Description

      unit-test on macos-1014

      Host: macos-1014-147.macstadium.build.10gen.cc
      Project: wiredtiger
      Commit: f7f24e33

      Task Logs:

      unit-test task_log

      Logs:

      Python Stacktrace
      ======================================================================
      FAIL: test_compact02.test_compact02.test_compact02(table.1mb.default) (subunit.RemotedTestCase)
      test_compact02.test_compact02.test_compact02(table.1mb.default)
      ----------------------------------------------------------------------
      testtools.testresult.real._StringException: Traceback (most recent call last):
        File "/data/mci/596139de9a1109b51864c2e8f6d5bc09/wiredtiger/test/suite/wttest.py", line 565, in tearDown
          self.captureout.check(self)
        File "/data/mci/596139de9a1109b51864c2e8f6d5bc09/wiredtiger/test/suite/wttest.py", line 116, in check
          testcase.fail('unexpected ' + self.desc + ', contains: "' +
        File "/usr/local/Cellar/python@3.9/3.9.6/Frameworks/Python.framework/Versions/3.9/lib/python3.9/unittest/case.py", line 670, in fail
          raise self.failureException(msg)
      AssertionError: unexpected standard output, contains: "[1651274647:433638][58420:0x11901c5c0], test_compact02.test_compact02.test_compact02(table.1mb.default), file:test_compact02.wt, WT_CURSOR.remove: [WT_VERB_TRANSACTION][NOTICE]: oldest pinned transaction ID rolled back for eviction
      [1651274661:571741][58420:0x11901c5c0], test_compact02.test_compact02.test_compact02(table.1mb.default), file:test_compact02.wt, WT_CURSOR.remove: [WT_VERB_TRANSACTION][NOTICE]: oldest pinned transaction ID rolled back for eviction
      "
      ----------------------------------------------------------------------
      Ran 8995 tests in 7895.426s
      Link: https://evergreen.mongodb.com/task_log_raw/wiredtiger_macos_1014_unit_test_f7f24e333ef9b7a8f62990f510c6a2d0a5690cf3_22_04_29_22_58_11/0?type=T#L33283
       
      Evergreen YAML Script Failure
      Command failed: command encountered problem: error waiting on process '7faa4a4a-2c8d-4d67-b777-e148673a136e': exit status 1
       
      Link: https://evergreen.mongodb.com/task_log_raw/wiredtiger_macos_1014_unit_test_f7f24e333ef9b7a8f62990f510c6a2d0a5690cf3_22_04_29_22_58_11/0?type=T#L33313
      

      logs

      Attachments

        Activity

          People

            backlog-server-storage-engines Backlog - Storage Engines Team
            Xgen-BuildBaron-User xgen-buildbaron-user
            Votes:
            0 Vote for this issue
            Watchers:
            3 Start watching this issue

            Dates

              Created:
              Updated: