Uploaded image for project: 'WiredTiger'
  1. WiredTiger
  2. WT-9269

failed: test_config11 assertion error on macos-1014 [wiredtiger @ 4932879a]

    XMLWordPrintable

Details

    • Build Failure
    • Status: Open
    • Major - P3
    • Resolution: Unresolved
    • None
    • None
    • None
    • StorEng - Refinement Pipeline

    Description

      unit-test on macos-1014

      Host: macos-1014-84.macstadium.build.10gen.cc
      Project: wiredtiger
      Commit: 4932879a

      Task Logs:

      unit-test task_log

      Logs:

      Python Stacktrace
      FAIL: test_config11.test_config11.test_config11(integer_row) (subunit.RemotedTestCase)
      test_config11.test_config11.test_config11(integer_row)
      ----------------------------------------------------------------------
      testtools.testresult.real._StringException: Traceback (most recent call last):
        File "/data/mci/43c237132040f3a503c76e5eb5f1c187/wiredtiger/test/suite/test_config11.py", line 91, in test_config11
          self.assertGreater(current_cache_usage, max_cache_size / 2)
        File "/usr/local/Cellar/python@3.9/3.9.7_1/Frameworks/Python.framework/Versions/3.9/lib/python3.9/unittest/case.py", line 1227, in assertGreater
          self.fail(self._formatMessage(msg, standardMsg))
        File "/usr/local/Cellar/python@3.9/3.9.7_1/Frameworks/Python.framework/Versions/3.9/lib/python3.9/unittest/case.py", line 668, in fail
          raise self.failureException(msg)
      AssertionError: 28618566 not greater than 52428800.0
      ----------------------------------------------------------------------
      Ran 8995 tests in 2511.963s
      Link: https://evergreen.mongodb.com/task_log_raw/wiredtiger_macos_1014_unit_test_4932879a4adae4922601eb3a445b465d2c3829e3_22_05_02_05_44_13/0?type=T#L33333
       
      Evergreen YAML Script Failure
      Command failed: command encountered problem: error waiting on process '1a0eff31-1159-48dc-8ecf-37e7c0e80e0c': exit status 1
       
      Link: https://evergreen.mongodb.com/task_log_raw/wiredtiger_macos_1014_unit_test_4932879a4adae4922601eb3a445b465d2c3829e3_22_05_02_05_44_13/0?type=T#L33349

      logs

      Attachments

        Activity

          People

            backlog-server-storage-engines Backlog - Storage Engines Team
            Xgen-BuildBaron-User xgen-buildbaron-user
            Votes:
            0 Vote for this issue
            Watchers:
            1 Start watching this issue

            Dates

              Created:
              Updated: