Uploaded image for project: 'WiredTiger'
  1. WiredTiger
  2. WT-9317

Checksum failure during stress testing on PPC

    • Type: Icon: Build Failure Build Failure
    • Resolution: Gone away
    • Priority: Icon: Major - P3 Major - P3
    • None
    • Affects Version/s: None
    • Component/s: None
    • NachoCheese - 2023-10-03

      format-stress-sanitizer-test-ppc-ubuntu on ubuntu1804-ppc

      Host: ubuntu1804-ppc-11.pic.build.10gen.cc
      Project: wiredtiger
      Commit: 91d67b19

      Task Logs:

      format-stress-sanitizer-test-ppc-ubuntu task_log

      Logs:

      [2022/05/12 09:51:29.451]     [1652349006:929018][17853:0x7f8aee2cf100], t, file:T00005.wt, WT_SESSION.verify: [WT_VERB_DEFAULT][ERROR]: int __wt_block_read_off(WT_SESSION_IMPL *, WT_BLOCK *, WT_ITEM *, uint32_t, wt_off_t, uint32_t, uint32_t), 224: T00005.wt: read checksum error for 512B block at offset 29994496: block header checksum of 0xfa59964b doesn't match expected checksum of 0xe8a9b83
      
       [2022/05/12 09:51:29.451]     [1652349006:929618][17853:0x7f8aee2cf100], t, file:T00005.wt, WT_SESSION.verify: [WT_VERB_DEFAULT][ERROR]: int __wt_bm_corrupt_dump(WT_SESSION_IMPL *, WT_ITEM *, uint32_t, wt_off_t, uint32_t, uint32_t), 77: {0: 29994496, 512, 0xe8a9b83}: (chunk 1 of 1): c8 0f 07 00 00 00 00 00 6c 07 02 00 00 00 00 00 f1 07 00 00 10 00 00 00 04 01 00 01 00 02 00 00 4b 96 59 fa 01 00 00 00 6b 44 55 50 4c 49 43 41 54 45 56 2f 4c 4d 4e 4f 50 51 52 53 54 55 56 57 78 9c 8b 88 8c 0a 36 00 02 13 33 23 73 4b 63 7d 1f 5f 3f ff 80 c0 a0 e0 90 6e b8 a0 09 42 30 34 2c 3c 22 32 ca d1 c9 d9 c5 d5 cd dd a3 19 ae c4 14 bb 92 70 b8 02 33 24 05 d5 70 51 73 6c da 98 11 ba 2c 91 e4 1b 8e de 83 8a 5b 18 18 e0 72 91 a7 97 f7 a8 cc a8 cc a8 cc a8 cc a8 cc a8 0c 49 32 ce f0 ea c5 10 52 bd 84 c3 05 8c 90 ea 9b 66 b8 a8 31 f6 5a c8 1a ae 00 5c 71 26 c3 b9 68 95 64 3e 5c c2 0c c3 20 84 1c 66 15 09 00 82 2d 47 d4 00 00 00 00 00 00 00 00 00 00 00 00 00 00 00 00 00 00 00 00 00 00 00 00 00 00 00 00 00 00 00 00 00 00 00 00 00 00 00 00 00 00 00 00 00 00 00 00 00 00 00 00 00 00 00 00 00 00 00 00 00 00 00 00 00 00 00 00 00 00 00 00 00 00 00 00 00 00 00 00 00 00 00 00 00 00 00 00 00 00 00 00 00 00 00 00 00 00 00 00 00 00 00 00 00 00 00 00 00 00 00 00 00 00 00 00 00 00 00 00 00 00 00 00 00 00 00 00 00 00 00 00 00 00 00 00 00 00 00 00 00 00 00 00 00 00 00 00 00 00 00 00 00 00 00 00 00 00 00 00 00 00 00 00 00 00 00 00 00 00 00 00 00 00 00 00 00 00 00 00 00 00 00 00 00 00 00 00 00 00 00 00 00 00 00 00 00 00 00 00 00 00 00 00 00 00 00 00 00 00 00 00 00 00 00 00 00 00 00 00 00 00 00 00 00 00 00 00 00 00 00 00 00 00 00 00 00 00 00 00 00 00 00 00 00 00 00 00 00 00 00 00 00 00 00 00 00 00 00 00 00 00 00 00 00 00 00 00 00 00 00 00 00 00 00 00 00 00 00 00 00 00 00 00 00 00 00 00 00 00 00 00 00 00 00 00 00 00 00 00 00 00 00
      
       [2022/05/12 09:51:29.451]     [1652349007:59505][17853:0x7f8aee2cf100], t, file:T00005.wt, WT_SESSION.verify: [WT_VERB_DEFAULT][ERROR]: int __verify_ckptfrag_chk(WT_SESSION_IMPL *, WT_BLOCK *), 520: checkpoint ranges never verified: 139
      
       [2022/05/12 09:51:29.451]     [1652349007:62319][17853:0x7f8aee2cf100], t, file:T00005.wt, WT_SESSION.verify: [WT_VERB_DEFAULT][ERROR]: int __verify_filefrag_chk(WT_SESSION_IMPL *, WT_BLOCK *), 434: file ranges never verified: 138
      
       [2022/05/12 09:51:29.451]     t: FAILED: void wts_verify(TABLE *, void *)/556: ret == 0 || ret == EBUSY
      

      Link: https://evergreen.mongodb.com/task_log_raw/wiredtiger_ubuntu1804_ppc_format_stress_sanitizer_test_ppc_ubuntu_91d67b193cb2981edfa5fc9e3bba1442d340c022_22_05_12_04_12_55/0?type=T#L7334

      logs

            Assignee:
            backlog-server-storage-engines Backlog - Storage Engines Team
            Reporter:
            Xgen-BuildBaron-User xgen-buildbaron-user
            Votes:
            0 Vote for this issue
            Watchers:
            5 Start watching this issue

              Created:
              Updated:
              Resolved: