Uploaded image for project: 'WiredTiger'
  1. WiredTiger
  2. WT-9472

Unexpected WT_ROLLBACK in test_wt8246_compact_rts_data_correctness when inserting data

    • 5
    • Storage Engines - 2022-06-27, Storage Engines - 2022-07-11

      make-check-test on macos-1014

      Host: macos-1014-129.macstadium.build.10gen.cc
      Project: wiredtiger
      Commit: c4ed70e9

      Task Logs:

      make-check-test task_log

      Logs:

      C Suite Failure Assertion message
       99/105 Test  #96: test_wt8246_compact_rts_data_correctness .........***Exception: Child aborted733.70 sec
      Link: https://evergreen.mongodb.com/task_log_raw/wiredtiger_macos_1014_make_check_test_c4ed70e9ecc3b5090f882010d3cc6984c517a176_22_06_15_14_51_58/0?type=T#L1397
      
      C/CPP Suite Failure message
      test_wt8246_compact_rts_data_correctness: FAILED: void large_updates(WT_SESSION *, const char *, char *, int)/340: cursor->insert(cursor): WT_ROLLBACK: conflict between concurrent operations
      
      Link: https://evergreen.mongodb.com/task_log_raw/wiredtiger_macos_1014_make_check_test_c4ed70e9ecc3b5090f882010d3cc6984c517a176_22_06_15_14_51_58/0?type=T#L1401
      
      Failure keywords
      test_wt8246_compact_rts_data_correctness: process aborting
      WiredTiger Error: void __wt_abort(WT_SESSION_IMPL *), 28: aborting WiredTiger library
      Link: https://evergreen.mongodb.com/task_log_raw/wiredtiger_macos_1014_make_check_test_c4ed70e9ecc3b5090f882010d3cc6984c517a176_22_06_15_14_51_58/0?type=T#L1402
      
      C/CPP Suite Failure message
      test_wt8246_compact_rts_data_correctness: FAILED: Child process 62713 abnormally exited: Invalid argument
      
      Link: https://evergreen.mongodb.com/task_log_raw/wiredtiger_macos_1014_make_check_test_c4ed70e9ecc3b5090f882010d3cc6984c517a176_22_06_15_14_51_58/0?type=T#L1406
      
      Failure keywords
      test_wt8246_compact_rts_data_correctness: process aborting
      WiredTiger Error: void __wt_abort(WT_SESSION_IMPL *), 28: aborting WiredTiger library
      Link: https://evergreen.mongodb.com/task_log_raw/wiredtiger_macos_1014_make_check_test_c4ed70e9ecc3b5090f882010d3cc6984c517a176_22_06_15_14_51_58/0?type=T#L1407
      
      C/CPP Suite Failure message
      The following tests FAILED:
      
      Link: https://evergreen.mongodb.com/task_log_raw/wiredtiger_macos_1014_make_check_test_c4ed70e9ecc3b5090f882010d3cc6984c517a176_22_06_15_14_51_58/0?type=T#L1425
      
      Evergreen YAML Script Failure
      Command failed: shell script encountered problem: exit code 8
      
      Link: https://evergreen.mongodb.com/task_log_raw/wiredtiger_macos_1014_make_check_test_c4ed70e9ecc3b5090f882010d3cc6984c517a176_22_06_15_14_51_58/0?type=T#L1430
      

      logs

            Assignee:
            ravi.giri@mongodb.com Ravi Giri
            Reporter:
            Xgen-BuildBaron-User xgen-buildbaron-user
            Votes:
            0 Vote for this issue
            Watchers:
            1 Start watching this issue

              Created:
              Updated:
              Resolved:

                Error rendering 'slack.nextup.jira:slack-integration-plus'. Please contact your Jira administrators.